{"text_format":"1","workbook":"xlsx","n_sheets":8,"sheets":["Budget Revision Summary","Budget Transcript","PIVOT","Budget Transcript page 2","Budget Transcript page 3","CALCS","NCHEMS","ACCT"],"not_rendered":{"charts":0,"images":2,"macros":1,"external_links":0,"defined_names":14,"comments":0,"pivot_tables":1},"unopened":[],"bounds":{"document_bytes":16777216,"sheet_cells":100000,"rows_first":2000,"rows_last":500,"rows_between":2000,"halvings":0,"cell_chars":16384,"cell_head_chars":4096},"cells_cut":0,"cells_raw":0,"read":"whole","date_system":"1904"}

{"sheet":"Budget Revision Summary","index":0,"n_rows":63,"n_cols":10,"rows_kept":63,"cut":false,"hidden":false,"merged":[[48,2,57,9],[47,8,47,9]]}
[]
[]
[]
[null,"Date",null,null,null,null,null,"Revision Number",{"$f":"CALCS!Z3","v":" "}]
[]
[null,null,{"$f":"CALCS!Z1","v":""},null,{"$f":"CALCS!Z2","v":""},{"$f":"CONCATENATE(\"By:  \",'Budget Transcript'!I8)","v":"By:  "},null,null,"Date:",{"$f":"TODAY()","v":"2014-09-08"}]
[null,null,"Allocation",null,"NCHEMS",{"$f":"CONCATENATE(\"Trans Count:  \",COUNT(CALCS!A3:A62))","v":"Trans Count:  0"},null,null,"Amount:",{"$f":"'Budget Transcript'!I7","v":0}]
[]
[null,"TYPE OF BUDGET REVISION (Check as appropriate)",null,null,null,null,null,null,"Approval Level"]
[null,null,"RP type 1A ","Non-personal services into/out of/within PS.",null,null,null,"-------------------","Chancellor"]
[null,null,"RP Type 1B","Out of Building Maintenance",null,null,null,"-------------------","VP of Finance"]
[null,null,"RP Type 2  ","Allocation transfer",null,null,null,"-------------------","Chancellor"]
[null,null,"RP Type 3A","Action on positions-no change in number",null,null,null,"-------------------","Chancellor"]
[null,null,null,"of total authorized positions"]
[null,null,"RP Type 3B","Change number of authorized positions.",null,null,null,"-------------------","VP of Finance & OMB"]
[null,null,"RP Type 4A","IAR revenue increase",null,null,null,"-------------------","Chancellor"]
[null,null,"RP Type 4B","Other revenue increases",null,null,null,"-------------------","VP of Finance & LB&A"]
[null,null,"RP Type 5","Revenue increase due to RSA receipt",null,null,null,"-------------------","VP of Finance & OMB"]
[]
[null,"Budget Line Item",null,"Alloc/","Alloc/","Alloc/","Alloc/","Alloc/","Alloc/","TOTAL"]
[null,null,null,"NCHEMS Cat. ","NCHEMS Cat. ","NCHEMS Cat. ","NCHEMS Cat. ","NCHEMS Cat. ","NCHEMS Cat. "]
[null,null,null,{"$f":"IF(PIVOT!C4=\"Grand Total\",\" \",IF(PIVOT!C4=0,\" \",LEFT(PIVOT!C4,18)))","v":" "},{"$f":"IF(PIVOT!D4=\"Grand Total\",\" \",IF(PIVOT!D4=0,\" \",LEFT(PIVOT!D4,18)))","v":" "},{"$f":"IF(PIVOT!E4=\"Grand Total\",\" \",IF(PIVOT!E4=0,\" \",LEFT(PIVOT!E4,18)))","v":" "},{"$f":"IF(PIVOT!F4=\"Grand Total\",\" \",IF(PIVOT!F4=0,\" \",LEFT(PIVOT!F4,18)))","v":" "},{"$f":"IF(PIVOT!G4=\"Grand Total\",\" \",IF(PIVOT!G4=0,\" \",LEFT(PIVOT!G4,18)))","v":" "},{"$f":"IF(PIVOT!H4=\"Grand Total\",\" \",IF(PIVOT!H4=0,\" \",LEFT(PIVOT!H4,18)))","v":" "}]
[null,"Personal Services",null,{"$f":"IF(D$22<>\" \",IFERROR(GETPIVOTDATA(\"Balance\",PIVOT!$A$3,\"ACCT Group\",\"E1\",\"Allocation / NCHEMS\",PIVOT!C$4),\" \"),\" \")","v":" "},{"$f":"IF(E$22<>\" \",IFERROR(GETPIVOTDATA(\"Balance\",PIVOT!$A$3,\"ACCT Group\",\"E1\",\"Allocation / NCHEMS\",PIVOT!D$4),\" \"),\" \")","v":" "},{"$f":"IF(F$22<>\" \",IFERROR(GETPIVOTDATA(\"Balance\",PIVOT!$A$3,\"ACCT Group\",\"E1\",\"Allocation / NCHEMS\",PIVOT!E$4),\" \"),\" \")","v":" "},{"$f":"IF(G$22<>\" \",IFERROR(GETPIVOTDATA(\"Balance\",PIVOT!$A$3,\"ACCT Group\",\"E1\",\"Allocation / NCHEMS\",PIVOT!F$4),\" \"),\" \")","v":" "},{"$f":"IF(H$22<>\" \",IFERROR(GETPIVOTDATA(\"Balance\",PIVOT!$A$3,\"ACCT Group\",\"E1\",\"Allocation / NCHEMS\",PIVOT!G$4),\" \"),\" \")","v":" "},{"$f":"IF(I$22<>\" \",IFERROR(GETPIVOTDATA(\"Balance\",PIVOT!$A$3,\"ACCT Group\",\"E1\",\"Allocation / NCHEMS\",PIVOT!H$4),\" \"),\" \")","v":" "},{"$f":"IF(SUM(D23:I23)=0,\" \",SUM(D23:I23))","v":" "}]
[null,"Travel",null,{"$f":"IF(D$22<>\" \",IFERROR(GETPIVOTDATA(\"Balance\",PIVOT!$A$3,\"ACCT Group\",\"E2\",\"Allocation / NCHEMS\",PIVOT!C$4),\" \"),\" \")","v":" "},{"$f":"IF(E$22<>\" \",IFERROR(GETPIVOTDATA(\"Balance\",PIVOT!$A$3,\"ACCT Group\",\"E2\",\"Allocation / NCHEMS\",PIVOT!D$4),\" \"),\" \")","v":" "},{"$f":"IF(F$22<>\" \",IFERROR(GETPIVOTDATA(\"Balance\",PIVOT!$A$3,\"ACCT Group\",\"E2\",\"Allocation / NCHEMS\",PIVOT!E$4),\" \"),\" \")","v":" "},{"$f":"IF(G$22<>\" \",IFERROR(GETPIVOTDATA(\"Balance\",PIVOT!$A$3,\"ACCT Group\",\"E2\",\"Allocation / NCHEMS\",PIVOT!F$4),\" \"),\" \")","v":" "},{"$f":"IF(H$22<>\" \",IFERROR(GETPIVOTDATA(\"Balance\",PIVOT!$A$3,\"ACCT Group\",\"E2\",\"Allocation / NCHEMS\",PIVOT!G$4),\" \"),\" \")","v":" "},{"$f":"IF(I$22<>\" \",IFERROR(GETPIVOTDATA(\"Balance\",PIVOT!$A$3,\"ACCT Group\",\"E2\",\"Allocation / NCHEMS\",PIVOT!H$4),\" \"),\" \")","v":" "},{"$f":"IF(SUM(D24:I24)=0,\" \",SUM(D24:I24))","v":" "}]
[null,"Contractual Services",null,{"$f":"IF(D$22<>\" \",IFERROR(GETPIVOTDATA(\"Balance\",PIVOT!$A$3,\"ACCT Group\",\"E3\",\"Allocation / NCHEMS\",PIVOT!C$4),\" \"),\" \")","v":" "},{"$f":"IF(E$22<>\" \",IFERROR(GETPIVOTDATA(\"Balance\",PIVOT!$A$3,\"ACCT Group\",\"E3\",\"Allocation / NCHEMS\",PIVOT!D$4),\" \"),\" \")","v":" "},{"$f":"IF(F$22<>\" \",IFERROR(GETPIVOTDATA(\"Balance\",PIVOT!$A$3,\"ACCT Group\",\"E3\",\"Allocation / NCHEMS\",PIVOT!E$4),\" \"),\" \")","v":" "},{"$f":"IF(G$22<>\" \",IFERROR(GETPIVOTDATA(\"Balance\",PIVOT!$A$3,\"ACCT Group\",\"E3\",\"Allocation / NCHEMS\",PIVOT!F$4),\" \"),\" \")","v":" "},{"$f":"IF(H$22<>\" \",IFERROR(GETPIVOTDATA(\"Balance\",PIVOT!$A$3,\"ACCT Group\",\"E3\",\"Allocation / NCHEMS\",PIVOT!G$4),\" \"),\" \")","v":" "},{"$f":"IF(I$22<>\" \",IFERROR(GETPIVOTDATA(\"Balance\",PIVOT!$A$3,\"ACCT Group\",\"E3\",\"Allocation / NCHEMS\",PIVOT!H$4),\" \"),\" \")","v":" "},{"$f":"IF(SUM(D25:I25)=0,\" \",SUM(D25:I25))","v":" "}]
[null,"Supplies",null,{"$f":"IF(D$22<>\" \",IFERROR(GETPIVOTDATA(\"Balance\",PIVOT!$A$3,\"ACCT Group\",\"E4\",\"Allocation / NCHEMS\",PIVOT!C$4),\" \"),\" \")","v":" "},{"$f":"IF(E$22<>\" \",IFERROR(GETPIVOTDATA(\"Balance\",PIVOT!$A$3,\"ACCT Group\",\"E4\",\"Allocation / NCHEMS\",PIVOT!D$4),\" \"),\" \")","v":" "},{"$f":"IF(F$22<>\" \",IFERROR(GETPIVOTDATA(\"Balance\",PIVOT!$A$3,\"ACCT Group\",\"E4\",\"Allocation / NCHEMS\",PIVOT!E$4),\" \"),\" \")","v":" "},{"$f":"IF(G$22<>\" \",IFERROR(GETPIVOTDATA(\"Balance\",PIVOT!$A$3,\"ACCT Group\",\"E4\",\"Allocation / NCHEMS\",PIVOT!F$4),\" \"),\" \")","v":" "},{"$f":"IF(H$22<>\" \",IFERROR(GETPIVOTDATA(\"Balance\",PIVOT!$A$3,\"ACCT Group\",\"E4\",\"Allocation / NCHEMS\",PIVOT!G$4),\" \"),\" \")","v":" "},{"$f":"IF(I$22<>\" \",IFERROR(GETPIVOTDATA(\"Balance\",PIVOT!$A$3,\"ACCT Group\",\"E4\",\"Allocation / NCHEMS\",PIVOT!H$4),\" \"),\" \")","v":" "},{"$f":"IF(SUM(D26:I26)=0,\" \",SUM(D26:I26))","v":" "}]
[null,"Equipment",null,{"$f":"IF(D$22<>\" \",IFERROR(GETPIVOTDATA(\"Balance\",PIVOT!$A$3,\"ACCT Group\",\"E5\",\"Allocation / NCHEMS\",PIVOT!C$4),\" \"),\" \")","v":" "},{"$f":"IF(E$22<>\" \",IFERROR(GETPIVOTDATA(\"Balance\",PIVOT!$A$3,\"ACCT Group\",\"E5\",\"Allocation / NCHEMS\",PIVOT!D$4),\" \"),\" \")","v":" "},{"$f":"IF(F$22<>\" \",IFERROR(GETPIVOTDATA(\"Balance\",PIVOT!$A$3,\"ACCT Group\",\"E5\",\"Allocation / NCHEMS\",PIVOT!E$4),\" \"),\" \")","v":" "},{"$f":"IF(G$22<>\" \",IFERROR(GETPIVOTDATA(\"Balance\",PIVOT!$A$3,\"ACCT Group\",\"E5\",\"Allocation / NCHEMS\",PIVOT!F$4),\" \"),\" \")","v":" "},{"$f":"IF(H$22<>\" \",IFERROR(GETPIVOTDATA(\"Balance\",PIVOT!$A$3,\"ACCT Group\",\"E5\",\"Allocation / NCHEMS\",PIVOT!G$4),\" \"),\" \")","v":" "},{"$f":"IF(I$22<>\" \",IFERROR(GETPIVOTDATA(\"Balance\",PIVOT!$A$3,\"ACCT Group\",\"E5\",\"Allocation / NCHEMS\",PIVOT!H$4),\" \"),\" \")","v":" "},{"$f":"IF(SUM(D27:I27)=0,\" \",SUM(D27:I27))","v":" "}]
[null,"Land/Buildings",null,{"$f":"IF(D$22<>\" \",IFERROR(GETPIVOTDATA(\"Balance\",PIVOT!$A$3,\"ACCT Group\",E6,\"Allocation / NCHEMS\",PIVOT!C$4),\" \"),\" \")","v":" "},{"$f":"IF(E$22<>\" \",IFERROR(GETPIVOTDATA(\"Balance\",PIVOT!$A$3,\"ACCT Group\",F6,\"Allocation / NCHEMS\",PIVOT!D$4),\" \"),\" \")","v":" "},{"$f":"IF(F$22<>\" \",IFERROR(GETPIVOTDATA(\"Balance\",PIVOT!$A$3,\"ACCT Group\",G6,\"Allocation / NCHEMS\",PIVOT!E$4),\" \"),\" \")","v":" "},{"$f":"IF(G$22<>\" \",IFERROR(GETPIVOTDATA(\"Balance\",PIVOT!$A$3,\"ACCT Group\",H6,\"Allocation / NCHEMS\",PIVOT!F$4),\" \"),\" \")","v":" "},{"$f":"IF(H$22<>\" \",IFERROR(GETPIVOTDATA(\"Balance\",PIVOT!$A$3,\"ACCT Group\",I6,\"Allocation / NCHEMS\",PIVOT!G$4),\" \"),\" \")","v":" "},{"$f":"IF(I$22<>\" \",IFERROR(GETPIVOTDATA(\"Balance\",PIVOT!$A$3,\"ACCT Group\",J6,\"Allocation / NCHEMS\",PIVOT!H$4),\" \"),\" \")","v":" "},{"$f":"IF(SUM(D28:I28)=0,\" \",SUM(D28:I28))","v":" "}]
[null,"Grants/Claims/Stu. Aid",null,{"$f":"IF(D$22<>\" \",IFERROR(GETPIVOTDATA(\"Balance\",PIVOT!$A$3,\"ACCT Group\",\"E7\",\"Allocation / NCHEMS\",PIVOT!C$4),\" \"),\" \")","v":" "},{"$f":"IF(E$22<>\" \",IFERROR(GETPIVOTDATA(\"Balance\",PIVOT!$A$3,\"ACCT Group\",\"E7\",\"Allocation / NCHEMS\",PIVOT!D$4),\" \"),\" \")","v":" "},{"$f":"IF(F$22<>\" \",IFERROR(GETPIVOTDATA(\"Balance\",PIVOT!$A$3,\"ACCT Group\",\"E7\",\"Allocation / NCHEMS\",PIVOT!E$4),\" \"),\" \")","v":" "},{"$f":"IF(G$22<>\" \",IFERROR(GETPIVOTDATA(\"Balance\",PIVOT!$A$3,\"ACCT Group\",\"E7\",\"Allocation / NCHEMS\",PIVOT!F$4),\" \"),\" \")","v":" "},{"$f":"IF(H$22<>\" \",IFERROR(GETPIVOTDATA(\"Balance\",PIVOT!$A$3,\"ACCT Group\",\"E7\",\"Allocation / NCHEMS\",PIVOT!G$4),\" \"),\" \")","v":" "},{"$f":"IF(I$22<>\" \",IFERROR(GETPIVOTDATA(\"Balance\",PIVOT!$A$3,\"ACCT Group\",\"E7\",\"Allocation / NCHEMS\",PIVOT!H$4),\" \"),\" \")","v":" "}," "]
[null,"Miscellaneous",null,{"$f":"IF(D$22<>\" \",IFERROR(GETPIVOTDATA(\"Balance\",PIVOT!$A$3,\"ACCT Group\",\"E8\",\"Allocation / NCHEMS\",PIVOT!C$4),\" \"),\" \")","v":" "},{"$f":"IF(E$22<>\" \",IFERROR(GETPIVOTDATA(\"Balance\",PIVOT!$A$3,\"ACCT Group\",\"E8\",\"Allocation / NCHEMS\",PIVOT!D$4),\" \"),\" \")","v":" "},{"$f":"IF(F$22<>\" \",IFERROR(GETPIVOTDATA(\"Balance\",PIVOT!$A$3,\"ACCT Group\",\"E8\",\"Allocation / NCHEMS\",PIVOT!E$4),\" \"),\" \")","v":" "},{"$f":"IF(G$22<>\" \",IFERROR(GETPIVOTDATA(\"Balance\",PIVOT!$A$3,\"ACCT Group\",\"E8\",\"Allocation / NCHEMS\",PIVOT!F$4),\" \"),\" \")","v":" "},{"$f":"IF(H$22<>\" \",IFERROR(GETPIVOTDATA(\"Balance\",PIVOT!$A$3,\"ACCT Group\",\"E8\",\"Allocation / NCHEMS\",PIVOT!G$4),\" \"),\" \")","v":" "},{"$f":"IF(I$22<>\" \",IFERROR(GETPIVOTDATA(\"Balance\",PIVOT!$A$3,\"ACCT Group\",\"E8\",\"Allocation / NCHEMS\",PIVOT!H$4),\" \"),\" \")","v":" "}," "]
[null,null,"TOTAL",{"$f":"IF(SUM(D23:D30)=0,\" \",SUM(D23:D30))","v":" "},{"$f":"IF(SUM(E23:E30)=0,\" \",SUM(E23:E30))","v":" "},{"$f":"IF(SUM(F23:F30)=0,\" \",SUM(F23:F30))","v":" "},{"$f":"IF(SUM(G23:G30)=0,\" \",SUM(G23:G30))","v":" "}," "," ",{"$f":"SUM(J23:J30)","v":0}]
[]
[null,"Auxiliary Receipts",null,{"$f":"IF(D$22<>\" \",IFERROR(-GETPIVOTDATA(\"Balance\",PIVOT!$A$3,\"ACCT Group\",\"R1\",\"Allocation / NCHEMS\",PIVOT!C$4),\" \"),\" \")","v":" "},{"$f":"IF(E$22<>\" \",IFERROR(-GETPIVOTDATA(\"Balance\",PIVOT!$A$3,\"ACCT Group\",\"R1\",\"Allocation / NCHEMS\",PIVOT!D$4),\" \"),\" \")","v":" "},{"$f":"IF(F$22<>\" \",IFERROR(-GETPIVOTDATA(\"Balance\",PIVOT!$A$3,\"ACCT Group\",\"R1\",\"Allocation / NCHEMS\",PIVOT!E$4),\" \"),\" \")","v":" "},{"$f":"IF(G$22<>\" \",IFERROR(-GETPIVOTDATA(\"Balance\",PIVOT!$A$3,\"ACCT Group\",\"R1\",\"Allocation / NCHEMS\",PIVOT!F$4),\" \"),\" \")","v":" "},{"$f":"IF(H$22<>\" \",IFERROR(-GETPIVOTDATA(\"Balance\",PIVOT!$A$3,\"ACCT Group\",\"R1\",\"Allocation / NCHEMS\",PIVOT!G$4),\" \"),\" \")","v":" "},{"$f":"IF(I$22<>\" \",IFERROR(-GETPIVOTDATA(\"Balance\",PIVOT!$A$3,\"ACCT Group\",\"R1\",\"Allocation / NCHEMS\",PIVOT!H$4),\" \"),\" \")","v":" "},{"$f":"IF(SUM(D33:I33)=0,\" \",SUM(D33:I33))","v":" "}]
[null,"CIP Receipts",null,{"$f":"IF(D$22<>\" \",IFERROR(-GETPIVOTDATA(\"Balance\",PIVOT!$A$3,\"ACCT Group\",\"R2\",\"Allocation / NCHEMS\",PIVOT!C$4),\" \"),\" \")","v":" "},{"$f":"IF(E$22<>\" \",IFERROR(-GETPIVOTDATA(\"Balance\",PIVOT!$A$3,\"ACCT Group\",\"R2\",\"Allocation / NCHEMS\",PIVOT!D$4),\" \"),\" \")","v":" "},{"$f":"IF(F$22<>\" \",IFERROR(-GETPIVOTDATA(\"Balance\",PIVOT!$A$3,\"ACCT Group\",\"R2\",\"Allocation / NCHEMS\",PIVOT!E$4),\" \"),\" \")","v":" "},{"$f":"IF(G$22<>\" \",IFERROR(-GETPIVOTDATA(\"Balance\",PIVOT!$A$3,\"ACCT Group\",\"R2\",\"Allocation / NCHEMS\",PIVOT!F$4),\" \"),\" \")","v":" "},{"$f":"IF(H$22<>\" \",IFERROR(-GETPIVOTDATA(\"Balance\",PIVOT!$A$3,\"ACCT Group\",\"R2\",\"Allocation / NCHEMS\",PIVOT!G$4),\" \"),\" \")","v":" "},{"$f":"IF(I$22<>\" \",IFERROR(-GETPIVOTDATA(\"Balance\",PIVOT!$A$3,\"ACCT Group\",\"R2\",\"Allocation / NCHEMS\",PIVOT!H$4),\" \"),\" \")","v":" "},{"$f":"IF(SUM(D34:I34)=0,\" \",SUM(D34:I34))","v":" "}]
[null,"Federal Receipts",null,{"$f":"IF(D$22<>\" \",IFERROR(-GETPIVOTDATA(\"Balance\",PIVOT!$A$3,\"ACCT Group\",\"R3\",\"Allocation / NCHEMS\",PIVOT!C$4),\" \"),\" \")","v":" "},{"$f":"IF(E$22<>\" \",IFERROR(-GETPIVOTDATA(\"Balance\",PIVOT!$A$3,\"ACCT Group\",\"R3\",\"Allocation / NCHEMS\",PIVOT!D$4),\" \"),\" \")","v":" "},{"$f":"IF(F$22<>\" \",IFERROR(-GETPIVOTDATA(\"Balance\",PIVOT!$A$3,\"ACCT Group\",\"R3\",\"Allocation / NCHEMS\",PIVOT!E$4),\" \"),\" \")","v":" "},{"$f":"IF(G$22<>\" \",IFERROR(-GETPIVOTDATA(\"Balance\",PIVOT!$A$3,\"ACCT Group\",\"R3\",\"Allocation / NCHEMS\",PIVOT!F$4),\" \"),\" \")","v":" "},{"$f":"IF(H$22<>\" \",IFERROR(-GETPIVOTDATA(\"Balance\",PIVOT!$A$3,\"ACCT Group\",\"R3\",\"Allocation / NCHEMS\",PIVOT!G$4),\" \"),\" \")","v":" "},{"$f":"IF(I$22<>\" \",IFERROR(-GETPIVOTDATA(\"Balance\",PIVOT!$A$3,\"ACCT Group\",\"R3\",\"Allocation / NCHEMS\",PIVOT!H$4),\" \"),\" \")","v":" "}," "]
[null,"General Fund",null,{"$f":"IF(D$22<>\" \",IFERROR(-GETPIVOTDATA(\"Balance\",PIVOT!$A$3,\"ACCT Group\",\"R4\",\"Allocation / NCHEMS\",PIVOT!C$4),\" \"),\" \")","v":" "},{"$f":"IF(E$22<>\" \",IFERROR(-GETPIVOTDATA(\"Balance\",PIVOT!$A$3,\"ACCT Group\",\"R4\",\"Allocation / NCHEMS\",PIVOT!D$4),\" \"),\" \")","v":" "},{"$f":"IF(F$22<>\" \",IFERROR(-GETPIVOTDATA(\"Balance\",PIVOT!$A$3,\"ACCT Group\",\"R4\",\"Allocation / NCHEMS\",PIVOT!E$4),\" \"),\" \")","v":" "},{"$f":"IF(G$22<>\" \",IFERROR(-GETPIVOTDATA(\"Balance\",PIVOT!$A$3,\"ACCT Group\",\"R4\",\"Allocation / NCHEMS\",PIVOT!F$4),\" \"),\" \")","v":" "},{"$f":"IF(H$22<>\" \",IFERROR(-GETPIVOTDATA(\"Balance\",PIVOT!$A$3,\"ACCT Group\",\"R4\",\"Allocation / NCHEMS\",PIVOT!G$4),\" \"),\" \")","v":" "},{"$f":"IF(I$22<>\" \",IFERROR(-GETPIVOTDATA(\"Balance\",PIVOT!$A$3,\"ACCT Group\",\"R4\",\"Allocation / NCHEMS\",PIVOT!H$4),\" \"),\" \")","v":" "}," "]
[null,"General Fund Match   ",null,{"$f":"IF(D$22<>\" \",IFERROR(-GETPIVOTDATA(\"Balance\",PIVOT!$A$3,\"ACCT Group\",\"R5\",\"Allocation / NCHEMS\",PIVOT!C$4),\" \"),\" \")","v":" "},{"$f":"IF(E$22<>\" \",IFERROR(-GETPIVOTDATA(\"Balance\",PIVOT!$A$3,\"ACCT Group\",\"R5\",\"Allocation / NCHEMS\",PIVOT!D$4),\" \"),\" \")","v":" "},{"$f":"IF(F$22<>\" \",IFERROR(-GETPIVOTDATA(\"Balance\",PIVOT!$A$3,\"ACCT Group\",\"R5\",\"Allocation / NCHEMS\",PIVOT!E$4),\" \"),\" \")","v":" "},{"$f":"IF(G$22<>\" \",IFERROR(-GETPIVOTDATA(\"Balance\",PIVOT!$A$3,\"ACCT Group\",\"R5\",\"Allocation / NCHEMS\",PIVOT!F$4),\" \"),\" \")","v":" "},{"$f":"IF(H$22<>\" \",IFERROR(-GETPIVOTDATA(\"Balance\",PIVOT!$A$3,\"ACCT Group\",\"R5\",\"Allocation / NCHEMS\",PIVOT!G$4),\" \"),\" \")","v":" "},{"$f":"IF(I$22<>\" \",IFERROR(-GETPIVOTDATA(\"Balance\",PIVOT!$A$3,\"ACCT Group\",\"R5\",\"Allocation / NCHEMS\",PIVOT!H$4),\" \"),\" \")","v":" "}," "]
[null,"Indirect Cost Recovery",null,{"$f":"IF(D$22<>\" \",IFERROR(-GETPIVOTDATA(\"Balance\",PIVOT!$A$3,\"ACCT Group\",\"R6\",\"Allocation / NCHEMS\",PIVOT!C$4),\" \"),\" \")","v":" "},{"$f":"IF(E$22<>\" \",IFERROR(-GETPIVOTDATA(\"Balance\",PIVOT!$A$3,\"ACCT Group\",\"R6\",\"Allocation / NCHEMS\",PIVOT!D$4),\" \"),\" \")","v":" "},{"$f":"IF(F$22<>\" \",IFERROR(-GETPIVOTDATA(\"Balance\",PIVOT!$A$3,\"ACCT Group\",\"R6\",\"Allocation / NCHEMS\",PIVOT!E$4),\" \"),\" \")","v":" "},{"$f":"IF(G$22<>\" \",IFERROR(-GETPIVOTDATA(\"Balance\",PIVOT!$A$3,\"ACCT Group\",\"R6\",\"Allocation / NCHEMS\",PIVOT!F$4),\" \"),\" \")","v":" "},{"$f":"IF(H$22<>\" \",IFERROR(-GETPIVOTDATA(\"Balance\",PIVOT!$A$3,\"ACCT Group\",\"R6\",\"Allocation / NCHEMS\",PIVOT!G$4),\" \"),\" \")","v":" "},{"$f":"IF(I$22<>\" \",IFERROR(-GETPIVOTDATA(\"Balance\",PIVOT!$A$3,\"ACCT Group\",\"R6\",\"Allocation / NCHEMS\",PIVOT!H$4),\" \"),\" \")","v":" "}," "]
[null,"Interest Income",null,{"$f":"IF(D$22<>\" \",IFERROR(-GETPIVOTDATA(\"Balance\",PIVOT!$A$3,\"ACCT Group\",\"R7\",\"Allocation / NCHEMS\",PIVOT!C$4),\" \"),\" \")","v":" "},{"$f":"IF(E$22<>\" \",IFERROR(-GETPIVOTDATA(\"Balance\",PIVOT!$A$3,\"ACCT Group\",\"R7\",\"Allocation / NCHEMS\",PIVOT!D$4),\" \"),\" \")","v":" "},{"$f":"IF(F$22<>\" \",IFERROR(-GETPIVOTDATA(\"Balance\",PIVOT!$A$3,\"ACCT Group\",\"R7\",\"Allocation / NCHEMS\",PIVOT!E$4),\" \"),\" \")","v":" "},{"$f":"IF(G$22<>\" \",IFERROR(-GETPIVOTDATA(\"Balance\",PIVOT!$A$3,\"ACCT Group\",\"R7\",\"Allocation / NCHEMS\",PIVOT!F$4),\" \"),\" \")","v":" "},{"$f":"IF(H$22<>\" \",IFERROR(-GETPIVOTDATA(\"Balance\",PIVOT!$A$3,\"ACCT Group\",\"R7\",\"Allocation / NCHEMS\",PIVOT!G$4),\" \"),\" \")","v":" "},{"$f":"IF(I$22<>\" \",IFERROR(-GETPIVOTDATA(\"Balance\",PIVOT!$A$3,\"ACCT Group\",\"R7\",\"Allocation / NCHEMS\",PIVOT!H$4),\" \"),\" \")","v":" "}," "]
[null,"Mental Health Trust",null,{"$f":"IF(D$22<>\" \",IFERROR(-GETPIVOTDATA(\"Balance\",PIVOT!$A$3,\"ACCT Group\",\"R8\",\"Allocation / NCHEMS\",PIVOT!C$4),\" \"),\" \")","v":" "},{"$f":"IF(E$22<>\" \",IFERROR(-GETPIVOTDATA(\"Balance\",PIVOT!$A$3,\"ACCT Group\",\"R8\",\"Allocation / NCHEMS\",PIVOT!D$4),\" \"),\" \")","v":" "},{"$f":"IF(F$22<>\" \",IFERROR(-GETPIVOTDATA(\"Balance\",PIVOT!$A$3,\"ACCT Group\",\"R8\",\"Allocation / NCHEMS\",PIVOT!E$4),\" \"),\" \")","v":" "},{"$f":"IF(G$22<>\" \",IFERROR(-GETPIVOTDATA(\"Balance\",PIVOT!$A$3,\"ACCT Group\",\"R8\",\"Allocation / NCHEMS\",PIVOT!F$4),\" \"),\" \")","v":" "},{"$f":"IF(H$22<>\" \",IFERROR(-GETPIVOTDATA(\"Balance\",PIVOT!$A$3,\"ACCT Group\",\"R8\",\"Allocation / NCHEMS\",PIVOT!G$4),\" \"),\" \")","v":" "},{"$f":"IF(I$22<>\" \",IFERROR(-GETPIVOTDATA(\"Balance\",PIVOT!$A$3,\"ACCT Group\",\"R8\",\"Allocation / NCHEMS\",PIVOT!H$4),\" \"),\" \")","v":" "}," "]
[null,"State Inter-Agency Receipts",null,{"$f":"IF(D$22<>\" \",IFERROR(-GETPIVOTDATA(\"Balance\",PIVOT!$A$3,\"ACCT Group\",\"R9\",\"Allocation / NCHEMS\",PIVOT!C$4),\" \"),\" \")","v":" "},{"$f":"IF(E$22<>\" \",IFERROR(-GETPIVOTDATA(\"Balance\",PIVOT!$A$3,\"ACCT Group\",\"R9\",\"Allocation / NCHEMS\",PIVOT!D$4),\" \"),\" \")","v":" "},{"$f":"IF(F$22<>\" \",IFERROR(-GETPIVOTDATA(\"Balance\",PIVOT!$A$3,\"ACCT Group\",\"R9\",\"Allocation / NCHEMS\",PIVOT!E$4),\" \"),\" \")","v":" "},{"$f":"IF(G$22<>\" \",IFERROR(-GETPIVOTDATA(\"Balance\",PIVOT!$A$3,\"ACCT Group\",\"R9\",\"Allocation / NCHEMS\",PIVOT!F$4),\" \"),\" \")","v":" "},{"$f":"IF(H$22<>\" \",IFERROR(-GETPIVOTDATA(\"Balance\",PIVOT!$A$3,\"ACCT Group\",\"R9\",\"Allocation / NCHEMS\",PIVOT!G$4),\" \"),\" \")","v":" "},{"$f":"IF(I$22<>\" \",IFERROR(-GETPIVOTDATA(\"Balance\",PIVOT!$A$3,\"ACCT Group\",\"R9\",\"Allocation / NCHEMS\",PIVOT!H$4),\" \"),\" \")","v":" "}," "]
[null,"Student Tuition/Fees",null,{"$f":"IF(D$22<>\" \",IFERROR(-GETPIVOTDATA(\"Balance\",PIVOT!$A$3,\"ACCT Group\",\"R10\",\"Allocation / NCHEMS\",PIVOT!C$4),\" \"),\" \")","v":" "},{"$f":"IF(E$22<>\" \",IFERROR(-GETPIVOTDATA(\"Balance\",PIVOT!$A$3,\"ACCT Group\",\"R10\",\"Allocation / NCHEMS\",PIVOT!D$4),\" \"),\" \")","v":" "},{"$f":"IF(F$22<>\" \",IFERROR(-GETPIVOTDATA(\"Balance\",PIVOT!$A$3,\"ACCT Group\",\"R10\",\"Allocation / NCHEMS\",PIVOT!E$4),\" \"),\" \")","v":" "},{"$f":"IF(G$22<>\" \",IFERROR(-GETPIVOTDATA(\"Balance\",PIVOT!$A$3,\"ACCT Group\",\"R10\",\"Allocation / NCHEMS\",PIVOT!F$4),\" \"),\" \")","v":" "},{"$f":"IF(H$22<>\" \",IFERROR(-GETPIVOTDATA(\"Balance\",PIVOT!$A$3,\"ACCT Group\",\"R10\",\"Allocation / NCHEMS\",PIVOT!G$4),\" \"),\" \")","v":" "},{"$f":"IF(I$22<>\" \",IFERROR(-GETPIVOTDATA(\"Balance\",PIVOT!$A$3,\"ACCT Group\",\"R10\",\"Allocation / NCHEMS\",PIVOT!H$4),\" \"),\" \")","v":" "}," "]
[null,"Tech Voc Educ Program",null,{"$f":"IF(D$22<>\" \",IFERROR(-GETPIVOTDATA(\"Balance\",PIVOT!$A$3,\"ACCT Group\",\"R11\",\"Allocation / NCHEMS\",PIVOT!C$4),\" \"),\" \")","v":" "},{"$f":"IF(E$22<>\" \",IFERROR(-GETPIVOTDATA(\"Balance\",PIVOT!$A$3,\"ACCT Group\",\"R11\",\"Allocation / NCHEMS\",PIVOT!D$4),\" \"),\" \")","v":" "},{"$f":"IF(F$22<>\" \",IFERROR(-GETPIVOTDATA(\"Balance\",PIVOT!$A$3,\"ACCT Group\",\"R11\",\"Allocation / NCHEMS\",PIVOT!E$4),\" \"),\" \")","v":" "},{"$f":"IF(G$22<>\" \",IFERROR(-GETPIVOTDATA(\"Balance\",PIVOT!$A$3,\"ACCT Group\",\"R11\",\"Allocation / NCHEMS\",PIVOT!F$4),\" \"),\" \")","v":" "},{"$f":"IF(H$22<>\" \",IFERROR(-GETPIVOTDATA(\"Balance\",PIVOT!$A$3,\"ACCT Group\",\"R11\",\"Allocation / NCHEMS\",PIVOT!G$4),\" \"),\" \")","v":" "},{"$f":"IF(I$22<>\" \",IFERROR(-GETPIVOTDATA(\"Balance\",PIVOT!$A$3,\"ACCT Group\",\"R11\",\"Allocation / NCHEMS\",PIVOT!H$4),\" \"),\" \")","v":" "}," "]
[null,"UA Intra-Agency Receipts",null,{"$f":"IF(D$22<>\" \",IFERROR(-GETPIVOTDATA(\"Balance\",PIVOT!$A$3,\"ACCT Group\",\"R12\",\"Allocation / NCHEMS\",PIVOT!C$4),\" \"),\" \")","v":" "},{"$f":"IF(E$22<>\" \",IFERROR(-GETPIVOTDATA(\"Balance\",PIVOT!$A$3,\"ACCT Group\",\"R12\",\"Allocation / NCHEMS\",PIVOT!D$4),\" \"),\" \")","v":" "},{"$f":"IF(F$22<>\" \",IFERROR(-GETPIVOTDATA(\"Balance\",PIVOT!$A$3,\"ACCT Group\",\"R12\",\"Allocation / NCHEMS\",PIVOT!E$4),\" \"),\" \")","v":" "},{"$f":"IF(G$22<>\" \",IFERROR(-GETPIVOTDATA(\"Balance\",PIVOT!$A$3,\"ACCT Group\",\"R12\",\"Allocation / NCHEMS\",PIVOT!F$4),\" \"),\" \")","v":" "},{"$f":"IF(H$22<>\" \",IFERROR(-GETPIVOTDATA(\"Balance\",PIVOT!$A$3,\"ACCT Group\",\"R12\",\"Allocation / NCHEMS\",PIVOT!G$4),\" \"),\" \")","v":" "},{"$f":"IF(I$22<>\" \",IFERROR(-GETPIVOTDATA(\"Balance\",PIVOT!$A$3,\"ACCT Group\",\"R12\",\"Allocation / NCHEMS\",PIVOT!H$4),\" \"),\" \")","v":" "}," "]
[null,"University Receipts",null,{"$f":"IF(D$22<>\" \",IFERROR(-GETPIVOTDATA(\"Balance\",PIVOT!$A$3,\"ACCT Group\",\"R13\",\"Allocation / NCHEMS\",PIVOT!C$4),\" \"),\" \")","v":" "},{"$f":"IF(E$22<>\" \",IFERROR(-GETPIVOTDATA(\"Balance\",PIVOT!$A$3,\"ACCT Group\",\"R13\",\"Allocation / NCHEMS\",PIVOT!D$4),\" \"),\" \")","v":" "},{"$f":"IF(F$22<>\" \",IFERROR(-GETPIVOTDATA(\"Balance\",PIVOT!$A$3,\"ACCT Group\",\"R13\",\"Allocation / NCHEMS\",PIVOT!E$4),\" \"),\" \")","v":" "},{"$f":"IF(G$22<>\" \",IFERROR(-GETPIVOTDATA(\"Balance\",PIVOT!$A$3,\"ACCT Group\",\"R13\",\"Allocation / NCHEMS\",PIVOT!F$4),\" \"),\" \")","v":" "},{"$f":"IF(H$22<>\" \",IFERROR(-GETPIVOTDATA(\"Balance\",PIVOT!$A$3,\"ACCT Group\",\"R13\",\"Allocation / NCHEMS\",PIVOT!G$4),\" \"),\" \")","v":" "},{"$f":"IF(I$22<>\" \",IFERROR(-GETPIVOTDATA(\"Balance\",PIVOT!$A$3,\"ACCT Group\",\"R13\",\"Allocation / NCHEMS\",PIVOT!H$4),\" \"),\" \")","v":" "},{"$f":"IF(SUM(D45:I45)=0,\" \",SUM(D45:I45))","v":" "}]
[null,null,"TOTAL",{"$f":"IF(SUM(D33:D45)=0,\" \",SUM(D33:D45))","v":" "},{"$f":"IF(SUM(E33:E45)=0,\" \",SUM(E33:E45))","v":" "}," "," "," "," ",{"$f":"SUM(J33:J45)","v":0}]
[]
[null,"EXPLANATION (continue on attached sheet if necessary)",null,null,null,null,null,"Unit BR Reference #:"]
[]
[]
[]
[]
[]
[]
[]
[]
[]
[]
[null,"AUTHORIZED SIGNATURES"]
[null,null,null,null,"______________________________"]
[null,"Cognizant Program Director",null,null,"Chancellor/MAU Budget Office",null,null,null,"SW Budget/VP Finance"]
[null,"Date:",null,null,"Date:",null,null,null,"Date:"]
[null,"rev 9/12"]

{"sheet":"Budget Transcript","index":1,"n_rows":35,"n_cols":15,"rows_kept":35,"cut":false,"hidden":false,"merged":[[12,2,12,6],[9,12,9,13],[5,12,5,13],[9,2,10,8],[0,0,0,9],[1,0,1,9],[2,0,2,9],[7,12,7,13],[8,12,8,13]]}
["UNIVERSITY OF ALASKA",null,null,null,null,null,null,null,null,null,null,"Permanent?","n"]
["BUDGET ENTRY TRANSCRIPT"]
["Budget Revision"]
[null,"BD Type",null,null,null,null,null,"Campus:  ",{"$f":"CALCS!Z1","v":""}]
[null,"BD01=Permanent Adopted Budget",null,"BD11=Permanent Adopted Position Bud",null,null,null,"Document No:  ",{"$f":"CALCS!Z3","v":" "}]
[null,"BD02=Permanent Budget Adjustments",null,"BD12=Permanent Budget Adjustment Pos",null,null,null,null,null,null,null,null,{"$f":"IF(TRUNC(M13,2)=TRUNC(N13,2),\"BALANCED\",\"UNBALANCED\")","v":"BALANCED"}]
[null,"BD03=Temporary Adopted Budget",null,"BD13=Temporary Adopted Position Bud",null,null,null,"Total Dollars:  ",{"$f":"SUM(CALCS!P3:Q62)","v":0},null,null,null,{"$f":"IF(TRUNC(M13,2)=TRUNC(N13,2),\" \",ABS(M13-N13))","v":" "},{"$f":"IF(TRUNC(M13,2)>TRUNC(N13,2),\"Expenditure\",IF(TRUNC(M13,2)=TRUNC(N13,2),\" \",\"Revenue\"))","v":" "}]
[null,"BD04=Temporary Budget Adjustments",null,"BD14=Temporary Budget Adjustment Pos",null,null,null,"Prepared By:  ",null,null,null,null,"Description Character Count: ",null,"Maximum:"]
[null,null,null,null,null,null,null,null,null,null,null,null,{"$f":"LEN(C10)","v":0},null,{"$f":"IF((SUM(H16:H35)+SUM('Budget Transcript page 2'!H16:H35)+SUM('Budget Transcript page 3'!H16:H35))>0,25,35)","v":35}]
[null,"Description:",null,null,null,null,null,null,null,null,null,null,"Document Totals"]
[null,null,null,null,null,null,null,null,null,null,null,null,"Expenditure","Revenue"]
[null,null,null,null,null,null,null,"Page:  ",{"$f":"IF('Budget Transcript page 2'!D16>0,IF('Budget Transcript page 3'!D16>0,\"1 of 3\",\"1 of 2\"),\"1 of 1\")","v":"1 of 1"},null,null,null,{"$f":"SUM(CALCS!T3:T62)","v":0},{"$f":"SUM(CALCS!U3:U62)","v":0},"Total Dollars"]
[null,null,"Accounting Information",null,null,null,null,null,null,null,null,null,{"$f":"SUM(CALCS!R3:R62)","v":0},{"$f":"SUM(CALCS!S3:S62)","v":0},"Sum"]
[null,null,"Fund","Org","Acct","Prog",null,"Position","Transaction","NCHEMS "]
[null,"BD Type","Code","Code","Code","Code","SBS","Number","Amount","Category"]
[1,{"$f":"CALCS!B3","v":" "},null,null,null,null,null,null,null,{"$f":"CALCS!J3","v":" "},null,{"$f":"IF(E16>0,IF(E16>1100,IF(E16<1672,IF(H16=0,\"PCN REQUIRED\",\" \"),IF(H16>0,\"PCN NOT ALLOWED\",\" \")),IF(H16>0,\"PCN NOT ALLOWED\",\" \")),IF(H16>0,\"PCN NOT ALLOWED\",\" \"))","v":" "}]
[2,{"$f":"CALCS!B4","v":" "},null,null,null,null,null,null,null,{"$f":"CALCS!J4","v":" "},null,{"$f":"IF(E17>0,IF(E17>1100,IF(E17<1672,IF(H17=0,\"PCN REQUIRED\",\" \"),IF(H17>0,\"PCN NOT ALLOWED\",\" \")),IF(H17>0,\"PCN NOT ALLOWED\",\" \")),IF(H17>0,\"PCN NOT ALLOWED\",\" \"))","v":" "}]
[3,{"$f":"CALCS!B5","v":" "},null,null,null,null,null,null,null,{"$f":"CALCS!J5","v":" "},null," "]
[4,{"$f":"CALCS!B6","v":" "},null,null,null,null,null,null,null,{"$f":"CALCS!J6","v":" "},null," "]
[5,{"$f":"CALCS!B7","v":" "},null,null,null,null,null,null,null,{"$f":"CALCS!J7","v":" "},null," "]
[6,{"$f":"CALCS!B8","v":" "},null,null,null,null,null,null,null,{"$f":"CALCS!J8","v":" "},null," "]
[7,{"$f":"CALCS!B9","v":" "},null,null,null,null,null,null,null,{"$f":"CALCS!J9","v":" "},null," "]
[8,{"$f":"CALCS!B10","v":" "},null,null,null,null,null,null,null,{"$f":"CALCS!J10","v":" "},null," "]
[9,{"$f":"CALCS!B11","v":" "},null,null,null,null,null,null,null,{"$f":"CALCS!J11","v":" "},null," "]
[10,{"$f":"CALCS!B12","v":" "},null,null,null,null,null,null,null,{"$f":"CALCS!J12","v":" "},null," "]
[11,{"$f":"CALCS!B13","v":" "},null,null,null,null,null,null,null,{"$f":"CALCS!J13","v":" "},null," "]
[12,{"$f":"CALCS!B14","v":" "},null,null,null,null,null,null,null,{"$f":"CALCS!J14","v":" "},null," "]
[13,{"$f":"CALCS!B15","v":" "},null,null,null,null,null,null,null,{"$f":"CALCS!J15","v":" "},null," "]
[14,{"$f":"CALCS!B16","v":" "},null,null,null,null,null,null,null,{"$f":"CALCS!J16","v":" "},null," "]
[15,{"$f":"CALCS!B17","v":" "},null,null,null,null,null,null,null,{"$f":"CALCS!J17","v":" "},null," "]
[16,{"$f":"CALCS!B18","v":" "},null,null,null,null,null,null,null,{"$f":"CALCS!J18","v":" "},null," "]
[17,{"$f":"CALCS!B19","v":" "},null,null,null,null,null,null,null,{"$f":"CALCS!J19","v":" "},null," "]
[18,{"$f":"CALCS!B20","v":" "},null,null,null,null,null,null,null,{"$f":"CALCS!J20","v":" "},null," "]
[19,{"$f":"CALCS!B21","v":" "},null,null,null,null,null,null,null,{"$f":"CALCS!J21","v":" "},null," "]
[20,{"$f":"CALCS!B22","v":" "},null,null,null,null,null,null,null,{"$f":"CALCS!J22","v":" "},null," "]

{"sheet":"PIVOT","index":2,"n_rows":6,"n_cols":3,"rows_kept":6,"cut":false,"hidden":true,"merged":[]}
[]
[]
["Sum of Balance","Allocation / NCHEMS"]
["ACCT Group"," ","Grand Total"]
[0,0,0]
["Grand Total",0,0]

{"sheet":"Budget Transcript page 2","index":3,"n_rows":35,"n_cols":12,"rows_kept":35,"cut":false,"hidden":false,"merged":[[9,2,10,8],[0,0,0,9],[1,0,1,9],[2,0,2,9],[12,2,12,6]]}
["UNIVERSITY OF ALASKA"]
["BUDGET ENTRY TRANSCRIPT"]
["Budget Revision"]
[null,"BD Type",null,null,null,null,null,"Campus:  ",{"$f":"'Budget Transcript'!I4","v":""}]
[null,"BD01=Permanent Adopted Budget",null,"BD11=Permanent Adopted Position Bud",null,null,null,"Document No:  ",{"$f":"'Budget Transcript'!I5","v":" "}]
[null,"BD02=Permanent Budget Adjustments",null,"BD12=Permanent Budget Adjustment Pos"]
[null,"BD03=Temporary Adopted Budget",null,"BD13=Temporary Adopted Position Bud",null,null,null,"Total Dollars:  ",{"$f":"'Budget Transcript'!I7","v":0}]
[null,"BD04=Temporary Budget Adjustments",null,"BD14=Temporary Budget Adjustment Pos",null,null,null,"Prepared By:  ",{"$f":"'Budget Transcript'!I8","v":0}]
[]
[null,"Description:",{"$f":"'Budget Transcript'!C10:I11","v":0}]
[]
[null,null,null,null,null,null,null,"Page:  ",{"$f":"IF('Budget Transcript page 3'!D16>0,\"2 of 3\",\"2 of 2\")","v":"2 of 2"}]
[null,null,"Accounting Information"]
[null,null,"Fund","Org","Acct","Prog",null,"Position","Transaction","NCHEMS "]
[null,"BD Type","Code","Code","Code","Code","SBS","Number","Amount","Category"]
[21,{"$f":"CALCS!B23","v":" "},null,null,null,null,null,null,null,{"$f":"CALCS!J23","v":" "},null,{"$f":"IF(E16>0,IF(E16>1100,IF(E16<1672,IF(H16=0,\"PCN REQUIRED\",\" \"),IF(H16>0,\"PCN NOT ALLOWED\",\" \")),IF(H16>0,\"PCN NOT ALLOWED\",\" \")),IF(H16>0,\"PCN NOT ALLOWED\",\" \"))","v":" "}]
[22,{"$f":"CALCS!B24","v":" "},null,null,null,null,null,null,null,{"$f":"CALCS!J24","v":" "},null,{"$f":"IF(E17>0,IF(E17>1100,IF(E17<1672,IF(H17=0,\"PCN REQUIRED\",\" \"),IF(H17>0,\"PCN NOT ALLOWED\",\" \")),IF(H17>0,\"PCN NOT ALLOWED\",\" \")),IF(H17>0,\"PCN NOT ALLOWED\",\" \"))","v":" "}]
[23,{"$f":"CALCS!B25","v":" "},null,null,null,null,null,null,null,{"$f":"CALCS!J25","v":" "},null," "]
[24,{"$f":"CALCS!B26","v":" "},null,null,null,null,null,null,null,{"$f":"CALCS!J26","v":" "},null," "]
[25,{"$f":"CALCS!B27","v":" "},null,null,null,null,null,null,null,{"$f":"CALCS!J27","v":" "},null," "]
[26,{"$f":"CALCS!B28","v":" "},null,null,null,null,null,null,null,{"$f":"CALCS!J28","v":" "},null," "]
[27,{"$f":"CALCS!B29","v":" "},null,null,null,null,null,null,null,{"$f":"CALCS!J29","v":" "},null," "]
[28,{"$f":"CALCS!B30","v":" "},null,null,null,null,null,null,null,{"$f":"CALCS!J30","v":" "},null," "]
[29,{"$f":"CALCS!B31","v":" "},null,null,null,null,null,null,null,{"$f":"CALCS!J31","v":" "},null," "]
[30,{"$f":"CALCS!B32","v":" "},null,null,null,null,null,null,null,{"$f":"CALCS!J32","v":" "},null," "]
[31,{"$f":"CALCS!B33","v":" "},null,null,null,null,null,null,null,{"$f":"CALCS!J33","v":" "},null," "]
[32,{"$f":"CALCS!B34","v":" "},null,null,null,null,null,null,null,{"$f":"CALCS!J34","v":" "},null," "]
[33,{"$f":"CALCS!B35","v":" "},null,null,null,null,null,null,null,{"$f":"CALCS!J35","v":" "},null," "]
[34,{"$f":"CALCS!B36","v":" "},null,null,null,null,null,null,null,{"$f":"CALCS!J36","v":" "},null," "]
[35,{"$f":"CALCS!B37","v":" "},null,null,null,null,null,null,null,{"$f":"CALCS!J37","v":" "},null," "]
[36,{"$f":"CALCS!B38","v":" "},null,null,null,null,null,null,null,{"$f":"CALCS!J38","v":" "},null," "]
[37,{"$f":"CALCS!B39","v":" "},null,null,null,null,null,null,null,{"$f":"CALCS!J39","v":" "},null," "]
[38,{"$f":"CALCS!B40","v":" "},null,null,null,null,null,null,null,{"$f":"CALCS!J40","v":" "},null," "]
[39,{"$f":"CALCS!B41","v":" "},null,null,null,null,null,null,null,{"$f":"CALCS!J41","v":" "},null," "]
[40,{"$f":"CALCS!B42","v":" "},null,null,null,null,null,null,null,{"$f":"CALCS!J42","v":" "},null," "]

{"sheet":"Budget Transcript page 3","index":4,"n_rows":35,"n_cols":12,"rows_kept":35,"cut":false,"hidden":false,"merged":[[9,2,10,8],[0,0,0,9],[1,0,1,9],[2,0,2,9],[12,2,12,6]]}
["UNIVERSITY OF ALASKA"]
["BUDGET ENTRY TRANSCRIPT"]
["Budget Revision"]
[null,"BD Type",null,null,null,null,null,"Campus:  ",{"$f":"'Budget Transcript'!I4","v":""}]
[null,"BD01=Permanent Adopted Budget",null,"BD11=Permanent Adopted Position Bud",null,null,null,"Document No:  ",{"$f":"'Budget Transcript'!I5","v":" "}]
[null,"BD02=Permanent Budget Adjustments",null,"BD12=Permanent Budget Adjustment Pos"]
[null,"BD03=Temporary Adopted Budget",null,"BD13=Temporary Adopted Position Bud",null,null,null,"Total Dollars:  ",{"$f":"'Budget Transcript page 2'!I7","v":0}]
[null,"BD04=Temporary Budget Adjustments",null,"BD14=Temporary Budget Adjustment Pos",null,null,null,"Prepared By:  ",{"$f":"'Budget Transcript'!I8","v":0}]
[]
[null,"Description:",{"$f":"'Budget Transcript'!C10:I11","v":0}]
[]
[null,null,null,null,null,null,null,"Page:  ",{"$f":"\"3 of 3\"","v":"3 of 3"}]
[null,null,"Accounting Information"]
[null,null,"Fund","Org","Acct","Prog",null,"Position","Transaction","NCHEMS "]
[null,"BD Type","Code","Code","Code","Code","SBS","Number","Amount","Category"]
[41,{"$f":"CALCS!B43","v":" "},null,null,null,null,null,null,null,{"$f":"CALCS!J43","v":" "},null,{"$f":"IF(E16>0,IF(E16>1100,IF(E16<1672,IF(H16=0,\"PCN REQUIRED\",\" \"),IF(H16>0,\"PCN NOT ALLOWED\",\" \")),IF(H16>0,\"PCN NOT ALLOWED\",\" \")),IF(H16>0,\"PCN NOT ALLOWED\",\" \"))","v":" "}]
[42,{"$f":"CALCS!B44","v":" "},null,null,null,null,null,null,null,{"$f":"CALCS!J44","v":" "},null,{"$f":"IF(E17>0,IF(E17>1100,IF(E17<1672,IF(H17=0,\"PCN REQUIRED\",\" \"),IF(H17>0,\"PCN NOT ALLOWED\",\" \")),IF(H17>0,\"PCN NOT ALLOWED\",\" \")),IF(H17>0,\"PCN NOT ALLOWED\",\" \"))","v":" "}]
[43,{"$f":"CALCS!B45","v":" "},null,null,null,null,null,null,null,{"$f":"CALCS!J45","v":" "},null," "]
[44,{"$f":"CALCS!B46","v":" "},null,null,null,null,null,null,null,{"$f":"CALCS!J46","v":" "},null," "]
[45,{"$f":"CALCS!B47","v":" "},null,null,null,null,null,null,null,{"$f":"CALCS!J47","v":" "},null," "]
[46,{"$f":"CALCS!B48","v":" "},null,null,null,null,null,null,null,{"$f":"CALCS!J48","v":" "},null," "]
[47,{"$f":"CALCS!B49","v":" "},null,null,null,null,null,null,null,{"$f":"CALCS!J49","v":" "},null," "]
[48,{"$f":"CALCS!B50","v":" "},null,null,null,null,null,null,null,{"$f":"CALCS!J50","v":" "},null," "]
[49,{"$f":"CALCS!B51","v":" "},null,null,null,null,null,null,null,{"$f":"CALCS!J51","v":" "},null," "]
[50,{"$f":"CALCS!B52","v":" "},null,null,null,null,null,null,null,{"$f":"CALCS!J52","v":" "},null," "]
[51,{"$f":"CALCS!B53","v":" "},null,null,null,null,null,null,null,{"$f":"CALCS!J53","v":" "},null," "]
[52,{"$f":"CALCS!B54","v":" "},null,null,null,null,null,null,null,{"$f":"CALCS!J54","v":" "},null," "]
[53,{"$f":"CALCS!B55","v":" "},null,null,null,null,null,null,null,{"$f":"CALCS!J55","v":" "},null," "]
[54,{"$f":"CALCS!B56","v":" "},null,null,null,null,null,null,null,{"$f":"CALCS!J56","v":" "},null," "]
[55,{"$f":"CALCS!B57","v":" "},null,null,null,null,null,null,null,{"$f":"CALCS!J57","v":" "},null," "]
[56,{"$f":"CALCS!B58","v":" "},null,null,null,null,null,null,null,{"$f":"CALCS!J58","v":" "},null," "]
[57,{"$f":"CALCS!B59","v":" "},null,null,null,null,null,null,null,{"$f":"CALCS!J59","v":" "},null," "]
[58,{"$f":"CALCS!B60","v":" "},null,null,null,null,null,null,null,{"$f":"CALCS!J60","v":" "},null," "]
[59,{"$f":"CALCS!B61","v":" "},null,null,null,null,null,null,null,{"$f":"CALCS!J61","v":" "},null," "]
[60,{"$f":"CALCS!B62","v":" "},null,null,null,null,null,null,null,{"$f":"CALCS!J62","v":" "},null," "]

{"sheet":"CALCS","index":5,"n_rows":62,"n_cols":51,"rows_kept":62,"cut":false,"hidden":true,"merged":[[1,5,1,6]]}
[null,null,"Account Code Information",null,null,null,null,null,null,null,null,null,null,null,null,null,null,null,null,null,null,null,null,null,"Allocations:",{"$f":"IF(AB1<>\" \",\"FC, \",)&IF(AC1<>\" \",\"FOR, \",)&IF(AD1<>\" \",\"BBC, \",)&IF(AE1<>\" \",\"CC, \",)&IF(AF1<>\" \",\"CES, \",)&IF(AG1<>\" \",\"CTC, \",)&IF(AH1<>\" \",\"IC, \",)&IF(AI1<>\" \",\"KC, \",)&IF(AJ1<>\" \",\"NC, \",)&IF(AK1<>\" \",\"RC\",)","v":""},null,{"$f":"IF(SUM(AB3:AB62)>0,AB2,\" \")","v":" "},{"$f":"IF(SUM(AC3:AC62)>0,AC2,\" \")","v":" "}," "," "," "," "," "," "," "," ",null,{"$f":"IF(SUM(AM3:AM62)>0,AM2,\" \")","v":" "},{"$f":"IF(SUM(AN3:AN62)>0,AN2,\" \")","v":" "}," "," "," "," "," "," "," "," "," "," "," "]
[null,"BD Type","Fund Code","Org Code","Acct Code","Program Code / SBS",null,"Position Number ","Transaction Amount","NCHEMS Category","ATYP","ATYP PRED","ACCT PRED","ACCT Designator","ACCT Group","Debit","Credit","Expenditure","Revenue","E-Sum","R-Sum","Allocation / NCHEMS","Alloc Abbr","NCHEMS Abbr","NCHEMS:",{"$f":"IF(AM1<>\" \",\"AS, \",)&IF(AN1<>\" \",\"AUX, \",)&IF(AO1<>\" \",\"DS, \",)&IF(AP1<>\" \",\"IS, \",)&IF(AQ1<>\" \",\"I, \",)&IF(AR1<>\" \",\"PP, \",)&IF(AS1<>\" \",\"PS, \",)&IF(AT1<>\" \",\"R, \",)&IF(AU1<>\" \",\"FA, \",)&IF(AV1<>\" \",\"SS, \",)&IF(AW1<>\" \",\"U\",)&IF(AX1<>\" \",\"L\",)&IF(AY1<>\" \",\"A\",)","v":""},null,"FC","FOR","BBC","CC","CES","CTC","IC","KC","NC","RC",null,"AS","AUX","DS","IS","I","PP","PS","R","FA","SS","U","L","A"]
[{"$f":"IF(C3>0,1,\" \")","v":" "},{"$f":"IF('Budget Transcript'!$M$1=\"Y\",IF(D3>0,IF(H3>0,\"11\",\"01\"),\" \"),IF(D3>0,IF(H3>0,\"14\",\"04\"),\" \"))","v":" "},{"$f":"'Budget Transcript'!C16","v":0},{"$f":"'Budget Transcript'!D16","v":0},{"$f":"'Budget Transcript'!E16","v":0},{"$f":"'Budget Transcript'!F16","v":0},{"$f":"'Budget Transcript'!G16","v":0},{"$f":"'Budget Transcript'!H16","v":0},{"$f":"'Budget Transcript'!I16","v":0},{"$f":"IF(D3>0,IFERROR(VLOOKUP(D3,NCHEMS,5,0),\"ERROR\"),\" \")","v":" "},{"$f":"IF($E3>0,IFERROR(VLOOKUP($E3,ACCT,3,0),\"ERROR\"),\" \")","v":" "},{"$f":"IF($E3>0,IFERROR(VLOOKUP($E3,ACCT,5,0),\"ERROR\"),\" \")","v":" "},{"$f":"IF($E3>0,IFERROR(VLOOKUP($E3,ACCT,7,0),\"ERROR\"),\" \")","v":" "},{"$f":"IF(E3>0,CHOOSE(TRUNC(E3/1000,0),L3,K3,K3,K3,M3,K3,K3,K3,IF(E3=9222,9222,IF(E3=9224,9224,IF(E3=9212,9212,M3)))),\" \")","v":" "},{"$f":"IF(N3<>\" \",VLOOKUP(N3,ACCT_GROUP,2,0),0)","v":0},{"$f":"IF(LEFT(O3,1)=\"E\",IF(I3>0,ABS(I3),0),IF(I3>0,0,ABS(I3)))","v":0},{"$f":"IF(LEFT(O3,1)=\"E\",IF(I3>0,0,ABS(I3)),IF(I3>0,ABS(I3),0))","v":0},{"$f":"IF(LEFT($O3,1)=\"E\",$I3,0)","v":0},{"$f":"IF(LEFT($O3,1)=\"R\",$I3,0)","v":0},{"$f":"ABS(R3)","v":0},{"$f":"ABS(S3)","v":0},{"$f":"IF(D3>0,VLOOKUP(D3,NCHEMS,3,0),\" \")","v":" "},{"$f":"IF(D3>0,VLOOKUP(D3,NCHEMS,4,0),\" \")","v":" "},{"$f":"IF(D3>0,VLOOKUP(D3,NCHEMS,5,0),\" \")","v":" "},"BR Prefix:",{"$f":"IF('Budget Transcript'!M1=\"Y\",\"UAF\",IF(W3<>\" \",VLOOKUP(W3,Prefix,3,0),\" \"))","v":" "},null,{"$f":"IF($W3=AB$2,1,0)","v":0},{"$f":"IF($W3=AC$2,1,0)","v":0},0,0,0,0,0,0,0,0,null,{"$f":"IF($X3=AM$2,1,0)","v":0},{"$f":"IF($X3=AN$2,1,0)","v":0},0,0,0,0,0,0,0,0,0,0,0]
[{"$f":"IF(C4>0,1,\" \")","v":" "},{"$f":"IF('Budget Transcript'!$M$1=\"Y\",IF(D4>0,IF(H4>0,\"11\",\"01\"),\" \"),IF(D4>0,IF(H4>0,\"14\",\"04\"),\" \"))","v":" "},{"$f":"IF('Budget Transcript'!C17=0,IF($I4<>0,C3,0),'Budget Transcript'!C17)","v":0},{"$f":"IF('Budget Transcript'!D17=0,IF($I4<>0,D3,0),'Budget Transcript'!D17)","v":0},{"$f":"IF('Budget Transcript'!E17=0,IF($I4<>0,E3,0),'Budget Transcript'!E17)","v":0},{"$f":"'Budget Transcript'!F17","v":0},{"$f":"'Budget Transcript'!G17","v":0},{"$f":"'Budget Transcript'!H17","v":0},{"$f":"'Budget Transcript'!I17","v":0}," "," "," "," ",{"$f":"IF(E4>0,CHOOSE(TRUNC(E4/1000,0),L4,K4,K4,K4,M4,K4,K4,K4,IF(E4=9222,9222,IF(E4=9224,9224,IF(E4=9212,9212,M4)))),\" \")","v":" "},{"$f":"IF(N4<>\" \",VLOOKUP(N4,ACCT_GROUP,2,0),0)","v":0},{"$f":"IF(LEFT(O4,1)=\"E\",IF(I4>0,ABS(I4),0),IF(I4>0,0,ABS(I4)))","v":0},{"$f":"IF(LEFT(O4,1)=\"E\",IF(I4>0,0,ABS(I4)),IF(I4>0,ABS(I4),0))","v":0},{"$f":"IF(LEFT($O4,1)=\"E\",$I4,0)","v":0},{"$f":"IF(LEFT($O4,1)=\"R\",$I4,0)","v":0},{"$f":"ABS(R4)","v":0},{"$f":"ABS(S4)","v":0}," "," "," ",null,null,null,{"$f":"IF($W4=AB$2,1,0)","v":0},0,0,0,0,0,0,0,0,0,null,{"$f":"IF($X4=AM$2,1,0)","v":0},0,0,0,0,0,0,0,0,0,0,0,0]
[" ",{"$f":"IF('Budget Transcript'!$M$1=\"Y\",IF(D5>0,IF(H5>0,\"11\",\"01\"),\" \"),IF(D5>0,IF(H5>0,\"14\",\"04\"),\" \"))","v":" "},{"$f":"IF('Budget Transcript'!C18=0,IF($I5<>0,C4,0),'Budget Transcript'!C18)","v":0},{"$f":"IF('Budget Transcript'!D18=0,IF($I5<>0,D4,0),'Budget Transcript'!D18)","v":0},{"$f":"IF('Budget Transcript'!E18=0,IF($I5<>0,E4,0),'Budget Transcript'!E18)","v":0},{"$f":"'Budget Transcript'!F18","v":0},{"$f":"'Budget Transcript'!G18","v":0},{"$f":"'Budget Transcript'!H18","v":0},{"$f":"'Budget Transcript'!I18","v":0}," "," "," "," "," ",0,0,0,0,0,0,0," "," "," ",null,null,null,0,0,0,0,0,0,0,0,0,0,null,0,0,0,0,0,0,0,0,0,0,0,0,0]
[" ",{"$f":"IF('Budget Transcript'!$M$1=\"Y\",IF(D6>0,IF(H6>0,\"11\",\"01\"),\" \"),IF(D6>0,IF(H6>0,\"14\",\"04\"),\" \"))","v":" "},{"$f":"IF('Budget Transcript'!C19=0,IF($I6<>0,C5,0),'Budget Transcript'!C19)","v":0},{"$f":"IF('Budget Transcript'!D19=0,IF($I6<>0,D5,0),'Budget Transcript'!D19)","v":0},{"$f":"IF('Budget Transcript'!E19=0,IF($I6<>0,E5,0),'Budget Transcript'!E19)","v":0},{"$f":"'Budget Transcript'!F19","v":0},{"$f":"'Budget Transcript'!G19","v":0},{"$f":"'Budget Transcript'!H19","v":0},{"$f":"'Budget Transcript'!I19","v":0}," "," "," "," "," ",0,0,0,0,0,0,0," "," "," ",null,null,null,0,0,0,0,0,0,0,0,0,0,null,0,0,0,0,0,0,0,0,0,0,0,0,0]
[" ",{"$f":"IF('Budget Transcript'!$M$1=\"Y\",IF(D7>0,IF(H7>0,\"11\",\"01\"),\" \"),IF(D7>0,IF(H7>0,\"14\",\"04\"),\" \"))","v":" "},{"$f":"IF('Budget Transcript'!C20=0,IF($I7<>0,C6,0),'Budget Transcript'!C20)","v":0},{"$f":"IF('Budget Transcript'!D20=0,IF($I7<>0,D6,0),'Budget Transcript'!D20)","v":0},{"$f":"IF('Budget Transcript'!E20=0,IF($I7<>0,E6,0),'Budget Transcript'!E20)","v":0},{"$f":"'Budget Transcript'!F20","v":0},{"$f":"'Budget Transcript'!G20","v":0},{"$f":"'Budget Transcript'!H20","v":0},{"$f":"'Budget Transcript'!I20","v":0}," "," "," "," "," ",0,0,0,0,0,0,0," "," "," ",null,null,null,0,0,0,0,0,0,0,0,0,0,null,0,0,0,0,0,0,0,0,0,0,0,0,0]
[" ",{"$f":"IF('Budget Transcript'!$M$1=\"Y\",IF(D8>0,IF(H8>0,\"11\",\"01\"),\" \"),IF(D8>0,IF(H8>0,\"14\",\"04\"),\" \"))","v":" "},{"$f":"IF('Budget Transcript'!C21=0,IF($I8<>0,C7,0),'Budget Transcript'!C21)","v":0},{"$f":"IF('Budget Transcript'!D21=0,IF($I8<>0,D7,0),'Budget Transcript'!D21)","v":0},{"$f":"IF('Budget Transcript'!E21=0,IF($I8<>0,E7,0),'Budget Transcript'!E21)","v":0},{"$f":"'Budget Transcript'!F21","v":0},{"$f":"'Budget Transcript'!G21","v":0},{"$f":"'Budget Transcript'!H21","v":0},{"$f":"'Budget Transcript'!I21","v":0}," "," "," "," "," ",0,0,0,0,0,0,0," "," "," ",null,null,null,0,0,0,0,0,0,0,0,0,0,null,0,0,0,0,0,0,0,0,0,0,0,0,0]
[" ",{"$f":"IF('Budget Transcript'!$M$1=\"Y\",IF(D9>0,IF(H9>0,\"11\",\"01\"),\" \"),IF(D9>0,IF(H9>0,\"14\",\"04\"),\" \"))","v":" "},{"$f":"IF('Budget Transcript'!C22=0,IF($I9<>0,C8,0),'Budget Transcript'!C22)","v":0},{"$f":"IF('Budget Transcript'!D22=0,IF($I9<>0,D8,0),'Budget Transcript'!D22)","v":0},{"$f":"IF('Budget Transcript'!E22=0,IF($I9<>0,E8,0),'Budget Transcript'!E22)","v":0},{"$f":"'Budget Transcript'!F22","v":0},{"$f":"'Budget Transcript'!G22","v":0},{"$f":"'Budget Transcript'!H22","v":0},{"$f":"'Budget Transcript'!I22","v":0}," "," "," "," "," ",0,0,0,0,0,0,0," "," "," ",null,null,null,0,0,0,0,0,0,0,0,0,0,null,0,0,0,0,0,0,0,0,0,0,0,0,0]
[" ",{"$f":"IF('Budget Transcript'!$M$1=\"Y\",IF(D10>0,IF(H10>0,\"11\",\"01\"),\" \"),IF(D10>0,IF(H10>0,\"14\",\"04\"),\" \"))","v":" "},{"$f":"IF('Budget Transcript'!C23=0,IF($I10<>0,C9,0),'Budget Transcript'!C23)","v":0},{"$f":"IF('Budget Transcript'!D23=0,IF($I10<>0,D9,0),'Budget Transcript'!D23)","v":0},{"$f":"IF('Budget Transcript'!E23=0,IF($I10<>0,E9,0),'Budget Transcript'!E23)","v":0},{"$f":"'Budget Transcript'!F23","v":0},{"$f":"'Budget Transcript'!G23","v":0},{"$f":"'Budget Transcript'!H23","v":0},{"$f":"'Budget Transcript'!I23","v":0}," "," "," "," "," ",0,0,0,0,0,0,0," "," "," ",null,null,null,0,0,0,0,0,0,0,0,0,0,null,0,0,0,0,0,0,0,0,0,0,0,0,0]
[" ",{"$f":"IF('Budget Transcript'!$M$1=\"Y\",IF(D11>0,IF(H11>0,\"11\",\"01\"),\" \"),IF(D11>0,IF(H11>0,\"14\",\"04\"),\" \"))","v":" "},{"$f":"IF('Budget Transcript'!C24=0,IF($I11<>0,C10,0),'Budget Transcript'!C24)","v":0},{"$f":"IF('Budget Transcript'!D24=0,IF($I11<>0,D10,0),'Budget Transcript'!D24)","v":0},{"$f":"IF('Budget Transcript'!E24=0,IF($I11<>0,E10,0),'Budget Transcript'!E24)","v":0},{"$f":"'Budget Transcript'!F24","v":0},{"$f":"'Budget Transcript'!G24","v":0},{"$f":"'Budget Transcript'!H24","v":0},{"$f":"'Budget Transcript'!I24","v":0}," "," "," "," "," ",0,0,0,0,0,0,0," "," "," ",null,null,null,0,0,0,0,0,0,0,0,0,0,null,0,0,0,0,0,0,0,0,0,0,0,0,0]
[" ",{"$f":"IF('Budget Transcript'!$M$1=\"Y\",IF(D12>0,IF(H12>0,\"11\",\"01\"),\" \"),IF(D12>0,IF(H12>0,\"14\",\"04\"),\" \"))","v":" "},{"$f":"IF('Budget Transcript'!C25=0,IF($I12<>0,C11,0),'Budget Transcript'!C25)","v":0},{"$f":"IF('Budget Transcript'!D25=0,IF($I12<>0,D11,0),'Budget Transcript'!D25)","v":0},{"$f":"IF('Budget Transcript'!E25=0,IF($I12<>0,E11,0),'Budget Transcript'!E25)","v":0},{"$f":"'Budget Transcript'!F25","v":0},{"$f":"'Budget Transcript'!G25","v":0},{"$f":"'Budget Transcript'!H25","v":0},{"$f":"'Budget Transcript'!I25","v":0}," "," "," "," "," ",0,0,0,0,0,0,0," "," "," ",null,null,null,0,0,0,0,0,0,0,0,0,0,null,0,0,0,0,0,0,0,0,0,0,0,0,0]
[" ",{"$f":"IF('Budget Transcript'!$M$1=\"Y\",IF(D13>0,IF(H13>0,\"11\",\"01\"),\" \"),IF(D13>0,IF(H13>0,\"14\",\"04\"),\" \"))","v":" "},{"$f":"IF('Budget Transcript'!C26=0,IF($I13<>0,C12,0),'Budget Transcript'!C26)","v":0},{"$f":"IF('Budget Transcript'!D26=0,IF($I13<>0,D12,0),'Budget Transcript'!D26)","v":0},{"$f":"IF('Budget Transcript'!E26=0,IF($I13<>0,E12,0),'Budget Transcript'!E26)","v":0},{"$f":"'Budget Transcript'!F26","v":0},{"$f":"'Budget Transcript'!G26","v":0},{"$f":"'Budget Transcript'!H26","v":0},{"$f":"'Budget Transcript'!I26","v":0}," "," "," "," "," ",0,0,0,0,0,0,0," "," "," ",null,null,null,0,0,0,0,0,0,0,0,0,0,null,0,0,0,0,0,0,0,0,0,0,0,0,0]
[" ",{"$f":"IF('Budget Transcript'!$M$1=\"Y\",IF(D14>0,IF(H14>0,\"11\",\"01\"),\" \"),IF(D14>0,IF(H14>0,\"14\",\"04\"),\" \"))","v":" "},{"$f":"IF('Budget Transcript'!C27=0,IF($I14<>0,C13,0),'Budget Transcript'!C27)","v":0},{"$f":"IF('Budget Transcript'!D27=0,IF($I14<>0,D13,0),'Budget Transcript'!D27)","v":0},{"$f":"IF('Budget Transcript'!E27=0,IF($I14<>0,E13,0),'Budget Transcript'!E27)","v":0},{"$f":"'Budget Transcript'!F27","v":0},{"$f":"'Budget Transcript'!G27","v":0},{"$f":"'Budget Transcript'!H27","v":0},{"$f":"'Budget Transcript'!I27","v":0}," "," "," "," "," ",0,0,0,0,0,0,0," "," "," ",null,null,null,0,0,0,0,0,0,0,0,0,0,null,0,0,0,0,0,0,0,0,0,0,0,0,0]
[" ",{"$f":"IF('Budget Transcript'!$M$1=\"Y\",IF(D15>0,IF(H15>0,\"11\",\"01\"),\" \"),IF(D15>0,IF(H15>0,\"14\",\"04\"),\" \"))","v":" "},{"$f":"IF('Budget Transcript'!C28=0,IF($I15<>0,C14,0),'Budget Transcript'!C28)","v":0},{"$f":"IF('Budget Transcript'!D28=0,IF($I15<>0,D14,0),'Budget Transcript'!D28)","v":0},{"$f":"IF('Budget Transcript'!E28=0,IF($I15<>0,E14,0),'Budget Transcript'!E28)","v":0},{"$f":"'Budget Transcript'!F28","v":0},{"$f":"'Budget Transcript'!G28","v":0},{"$f":"'Budget Transcript'!H28","v":0},{"$f":"'Budget Transcript'!I28","v":0}," "," "," "," "," ",0,0,0,0,0,0,0," "," "," ",null,null,null,0,0,0,0,0,0,0,0,0,0,null,0,0,0,0,0,0,0,0,0,0,0,0,0]
[" ",{"$f":"IF('Budget Transcript'!$M$1=\"Y\",IF(D16>0,IF(H16>0,\"11\",\"01\"),\" \"),IF(D16>0,IF(H16>0,\"14\",\"04\"),\" \"))","v":" "},{"$f":"IF('Budget Transcript'!C29=0,IF($I16<>0,C15,0),'Budget Transcript'!C29)","v":0},{"$f":"IF('Budget Transcript'!D29=0,IF($I16<>0,D15,0),'Budget Transcript'!D29)","v":0},{"$f":"IF('Budget Transcript'!E29=0,IF($I16<>0,E15,0),'Budget Transcript'!E29)","v":0},{"$f":"'Budget Transcript'!F29","v":0},{"$f":"'Budget Transcript'!G29","v":0},{"$f":"'Budget Transcript'!H29","v":0},{"$f":"'Budget Transcript'!I29","v":0}," "," "," "," "," ",0,0,0,0,0,0,0," "," "," ",null,null,null,0,0,0,0,0,0,0,0,0,0,null,0,0,0,0,0,0,0,0,0,0,0,0,0]
[" ",{"$f":"IF('Budget Transcript'!$M$1=\"Y\",IF(D17>0,IF(H17>0,\"11\",\"01\"),\" \"),IF(D17>0,IF(H17>0,\"14\",\"04\"),\" \"))","v":" "},{"$f":"IF('Budget Transcript'!C30=0,IF($I17<>0,C16,0),'Budget Transcript'!C30)","v":0},{"$f":"IF('Budget Transcript'!D30=0,IF($I17<>0,D16,0),'Budget Transcript'!D30)","v":0},{"$f":"IF('Budget Transcript'!E30=0,IF($I17<>0,E16,0),'Budget Transcript'!E30)","v":0},{"$f":"'Budget Transcript'!F30","v":0},{"$f":"'Budget Transcript'!G30","v":0},{"$f":"'Budget Transcript'!H30","v":0},{"$f":"'Budget Transcript'!I30","v":0}," "," "," "," "," ",0,0,0,0,0,0,0," "," "," ",null,null,null,0,0,0,0,0,0,0,0,0,0,null,0,0,0,0,0,0,0,0,0,0,0,0,0]
[" ",{"$f":"IF('Budget Transcript'!$M$1=\"Y\",IF(D18>0,IF(H18>0,\"11\",\"01\"),\" \"),IF(D18>0,IF(H18>0,\"14\",\"04\"),\" \"))","v":" "},{"$f":"IF('Budget Transcript'!C31=0,IF($I18<>0,C17,0),'Budget Transcript'!C31)","v":0},{"$f":"IF('Budget Transcript'!D31=0,IF($I18<>0,D17,0),'Budget Transcript'!D31)","v":0},{"$f":"IF('Budget Transcript'!E31=0,IF($I18<>0,E17,0),'Budget Transcript'!E31)","v":0},{"$f":"'Budget Transcript'!F31","v":0},{"$f":"'Budget Transcript'!G31","v":0},{"$f":"'Budget Transcript'!H31","v":0},{"$f":"'Budget Transcript'!I31","v":0}," "," "," "," "," ",0,0,0,0,0,0,0," "," "," ",null,null,null,0,0,0,0,0,0,0,0,0,0,null,0,0,0,0,0,0,0,0,0,0,0,0,0]
[" ",{"$f":"IF('Budget Transcript'!$M$1=\"Y\",IF(D19>0,IF(H19>0,\"11\",\"01\"),\" \"),IF(D19>0,IF(H19>0,\"14\",\"04\"),\" \"))","v":" "},{"$f":"IF('Budget Transcript'!C32=0,IF($I19<>0,C18,0),'Budget Transcript'!C32)","v":0},{"$f":"IF('Budget Transcript'!D32=0,IF($I19<>0,D18,0),'Budget Transcript'!D32)","v":0},{"$f":"IF('Budget Transcript'!E32=0,IF($I19<>0,E18,0),'Budget Transcript'!E32)","v":0},{"$f":"'Budget Transcript'!F32","v":0},{"$f":"'Budget Transcript'!G32","v":0},{"$f":"'Budget Transcript'!H32","v":0},{"$f":"'Budget Transcript'!I32","v":0}," "," "," "," "," ",0,0,0,0,0,0,0," "," "," ",null,null,null,0,0,0,0,0,0,0,0,0,0,null,0,0,0,0,0,0,0,0,0,0,0,0,0]
[" ",{"$f":"IF('Budget Transcript'!$M$1=\"Y\",IF(D20>0,IF(H20>0,\"11\",\"01\"),\" \"),IF(D20>0,IF(H20>0,\"14\",\"04\"),\" \"))","v":" "},{"$f":"IF('Budget Transcript'!C33=0,IF($I20<>0,C19,0),'Budget Transcript'!C33)","v":0},{"$f":"IF('Budget Transcript'!D33=0,IF($I20<>0,D19,0),'Budget Transcript'!D33)","v":0},{"$f":"IF('Budget Transcript'!E33=0,IF($I20<>0,E19,0),'Budget Transcript'!E33)","v":0},{"$f":"'Budget Transcript'!F33","v":0},{"$f":"'Budget Transcript'!G33","v":0},{"$f":"'Budget Transcript'!H33","v":0},{"$f":"'Budget Transcript'!I33","v":0}," "," "," "," "," ",0,0,0,0,0,0,0," "," "," ",null,null,null,{"$f":"IF($W20=AB$2,1,0)","v":0},0,0,0,0,0,0,0,0,0,null,0,0,0,0,0,0,0,0,0,0,0,0,0]
[" ",{"$f":"IF('Budget Transcript'!$M$1=\"Y\",IF(D21>0,IF(H21>0,\"11\",\"01\"),\" \"),IF(D21>0,IF(H21>0,\"14\",\"04\"),\" \"))","v":" "},{"$f":"IF('Budget Transcript'!C34=0,IF($I21<>0,C20,0),'Budget Transcript'!C34)","v":0},{"$f":"IF('Budget Transcript'!D34=0,IF($I21<>0,D20,0),'Budget Transcript'!D34)","v":0},{"$f":"IF('Budget Transcript'!E34=0,IF($I21<>0,E20,0),'Budget Transcript'!E34)","v":0},{"$f":"'Budget Transcript'!F34","v":0},{"$f":"'Budget Transcript'!G34","v":0},{"$f":"'Budget Transcript'!H34","v":0},{"$f":"'Budget Transcript'!I34","v":0}," "," "," "," "," ",0,0,0,0,0,0,0," "," "," ",null,null,null,0,0,0,0,0,0,0,0,0,0,null,0,0,0,0,0,0,0,0,0,0,0,0,0]
[" ",{"$f":"IF('Budget Transcript'!$M$1=\"Y\",IF(D22>0,IF(H22>0,\"11\",\"01\"),\" \"),IF(D22>0,IF(H22>0,\"14\",\"04\"),\" \"))","v":" "},{"$f":"IF('Budget Transcript'!C35=0,IF($I22<>0,C21,0),'Budget Transcript'!C35)","v":0},{"$f":"IF('Budget Transcript'!D35=0,IF($I22<>0,D21,0),'Budget Transcript'!D35)","v":0},{"$f":"IF('Budget Transcript'!E35=0,IF($I22<>0,E21,0),'Budget Transcript'!E35)","v":0},{"$f":"'Budget Transcript'!F35","v":0},{"$f":"'Budget Transcript'!G35","v":0},{"$f":"'Budget Transcript'!H35","v":0},{"$f":"'Budget Transcript'!I35","v":0}," "," "," "," "," ",0,0,0,0,0,0,0," "," "," ",null,null,null,0,0,0,0,0,0,0,0,0,0,null,0,0,0,0,0,0,0,0,0,0,0,0,0]
[" ",{"$f":"IF('Budget Transcript'!$M$1=\"Y\",IF(D23>0,IF(H23>0,\"11\",\"01\"),\" \"),IF(D23>0,IF(H23>0,\"14\",\"04\"),\" \"))","v":" "},{"$f":"'Budget Transcript page 2'!C16","v":0},{"$f":"'Budget Transcript page 2'!D16","v":0},{"$f":"'Budget Transcript page 2'!E16","v":0},{"$f":"'Budget Transcript page 2'!F16","v":0},{"$f":"'Budget Transcript page 2'!G16","v":0},{"$f":"'Budget Transcript page 2'!H16","v":0},{"$f":"'Budget Transcript page 2'!I16","v":0}," "," "," "," "," ",0,0,0,0,0,0,0," "," "," ",null,null,null,0,0,0,0,0,0,0,0,0,0,null,0,0,0,0,0,0,0,0,0,0,0,0,0]
[" ",{"$f":"IF('Budget Transcript'!$M$1=\"Y\",IF(D24>0,IF(H24>0,\"11\",\"01\"),\" \"),IF(D24>0,IF(H24>0,\"14\",\"04\"),\" \"))","v":" "},{"$f":"IF('Budget Transcript page 2'!C17=0,IF($I24<>0,C23,0),'Budget Transcript page 2'!C17)","v":0},{"$f":"IF('Budget Transcript page 2'!D17=0,IF($I24<>0,D23,0),'Budget Transcript page 2'!D17)","v":0},{"$f":"IF('Budget Transcript page 2'!E17=0,IF($I24<>0,E23,0),'Budget Transcript page 2'!E17)","v":0},{"$f":"'Budget Transcript page 2'!F17","v":0},{"$f":"'Budget Transcript page 2'!G17","v":0},{"$f":"'Budget Transcript page 2'!H17","v":0},{"$f":"'Budget Transcript page 2'!I17","v":0}," "," "," "," "," ",0,0,0,0,0,0,0," "," "," ",null,null,null,0,0,0,0,0,0,0,0,0,0,null,0,0,0,0,0,0,0,0,0,0,0,0,0]
[" ",{"$f":"IF('Budget Transcript'!$M$1=\"Y\",IF(D25>0,IF(H25>0,\"11\",\"01\"),\" \"),IF(D25>0,IF(H25>0,\"14\",\"04\"),\" \"))","v":" "},{"$f":"IF('Budget Transcript page 2'!C18=0,IF($I25<>0,C24,0),'Budget Transcript page 2'!C18)","v":0},{"$f":"IF('Budget Transcript page 2'!D18=0,IF($I25<>0,D24,0),'Budget Transcript page 2'!D18)","v":0},{"$f":"IF('Budget Transcript page 2'!E18=0,IF($I25<>0,E24,0),'Budget Transcript page 2'!E18)","v":0},{"$f":"'Budget Transcript page 2'!F18","v":0},{"$f":"'Budget Transcript page 2'!G18","v":0},{"$f":"'Budget Transcript page 2'!H18","v":0},{"$f":"'Budget Transcript page 2'!I18","v":0}," "," "," "," "," ",0,0,0,0,0,0,0," "," "," ",null,null,null,0,0,0,0,0,0,0,0,0,0,null,0,0,0,0,0,0,0,0,0,0,0,0,0]
[" ",{"$f":"IF('Budget Transcript'!$M$1=\"Y\",IF(D26>0,IF(H26>0,\"11\",\"01\"),\" \"),IF(D26>0,IF(H26>0,\"14\",\"04\"),\" \"))","v":" "},{"$f":"IF('Budget Transcript page 2'!C19=0,IF($I26<>0,C25,0),'Budget Transcript page 2'!C19)","v":0},{"$f":"IF('Budget Transcript page 2'!D19=0,IF($I26<>0,D25,0),'Budget Transcript page 2'!D19)","v":0},{"$f":"IF('Budget Transcript page 2'!E19=0,IF($I26<>0,E25,0),'Budget Transcript page 2'!E19)","v":0},{"$f":"'Budget Transcript page 2'!F19","v":0},{"$f":"'Budget Transcript page 2'!G19","v":0},{"$f":"'Budget Transcript page 2'!H19","v":0},{"$f":"'Budget Transcript page 2'!I19","v":0}," "," "," "," "," ",0,0,0,0,0,0,0," "," "," ",null,null,null,0,0,0,0,0,0,0,0,0,0,null,0,0,0,0,0,0,0,0,0,0,0,0,0]
[" ",{"$f":"IF('Budget Transcript'!$M$1=\"Y\",IF(D27>0,IF(H27>0,\"11\",\"01\"),\" \"),IF(D27>0,IF(H27>0,\"14\",\"04\"),\" \"))","v":" "},{"$f":"IF('Budget Transcript page 2'!C20=0,IF($I27<>0,C26,0),'Budget Transcript page 2'!C20)","v":0},{"$f":"IF('Budget Transcript page 2'!D20=0,IF($I27<>0,D26,0),'Budget Transcript page 2'!D20)","v":0},{"$f":"IF('Budget Transcript page 2'!E20=0,IF($I27<>0,E26,0),'Budget Transcript page 2'!E20)","v":0},{"$f":"'Budget Transcript page 2'!F20","v":0},{"$f":"'Budget Transcript page 2'!G20","v":0},{"$f":"'Budget Transcript page 2'!H20","v":0},{"$f":"'Budget Transcript page 2'!I20","v":0}," "," "," "," "," ",0,0,0,0,0,0,0," "," "," ",null,null,null,0,0,0,0,0,0,0,0,0,0,null,0,0,0,0,0,0,0,0,0,0,0,0,0]
[" ",{"$f":"IF('Budget Transcript'!$M$1=\"Y\",IF(D28>0,IF(H28>0,\"11\",\"01\"),\" \"),IF(D28>0,IF(H28>0,\"14\",\"04\"),\" \"))","v":" "},{"$f":"IF('Budget Transcript page 2'!C21=0,IF($I28<>0,C27,0),'Budget Transcript page 2'!C21)","v":0},{"$f":"IF('Budget Transcript page 2'!D21=0,IF($I28<>0,D27,0),'Budget Transcript page 2'!D21)","v":0},{"$f":"IF('Budget Transcript page 2'!E21=0,IF($I28<>0,E27,0),'Budget Transcript page 2'!E21)","v":0},{"$f":"'Budget Transcript page 2'!F21","v":0},{"$f":"'Budget Transcript page 2'!G21","v":0},{"$f":"'Budget Transcript page 2'!H21","v":0},{"$f":"'Budget Transcript page 2'!I21","v":0}," "," "," "," "," ",0,0,0,0,0,0,0," "," "," ",null,null,null,0,0,0,0,0,0,0,0,0,0,null,0,0,0,0,0,0,0,0,0,0,0,0,0]
[" ",{"$f":"IF('Budget Transcript'!$M$1=\"Y\",IF(D29>0,IF(H29>0,\"11\",\"01\"),\" \"),IF(D29>0,IF(H29>0,\"14\",\"04\"),\" \"))","v":" "},{"$f":"IF('Budget Transcript page 2'!C22=0,IF($I29<>0,C28,0),'Budget Transcript page 2'!C22)","v":0},{"$f":"IF('Budget Transcript page 2'!D22=0,IF($I29<>0,D28,0),'Budget Transcript page 2'!D22)","v":0},{"$f":"IF('Budget Transcript page 2'!E22=0,IF($I29<>0,E28,0),'Budget Transcript page 2'!E22)","v":0},{"$f":"'Budget Transcript page 2'!F22","v":0},{"$f":"'Budget Transcript page 2'!G22","v":0},{"$f":"'Budget Transcript page 2'!H22","v":0},{"$f":"'Budget Transcript page 2'!I22","v":0}," "," "," "," "," ",0,0,0,0,0,0,0," "," "," ",null,null,null,0,0,0,0,0,0,0,0,0,0,null,0,0,0,0,0,0,0,0,0,0,0,0,0]
[" ",{"$f":"IF('Budget Transcript'!$M$1=\"Y\",IF(D30>0,IF(H30>0,\"11\",\"01\"),\" \"),IF(D30>0,IF(H30>0,\"14\",\"04\"),\" \"))","v":" "},{"$f":"IF('Budget Transcript page 2'!C23=0,IF($I30<>0,C29,0),'Budget Transcript page 2'!C23)","v":0},{"$f":"IF('Budget Transcript page 2'!D23=0,IF($I30<>0,D29,0),'Budget Transcript page 2'!D23)","v":0},{"$f":"IF('Budget Transcript page 2'!E23=0,IF($I30<>0,E29,0),'Budget Transcript page 2'!E23)","v":0},{"$f":"'Budget Transcript page 2'!F23","v":0},{"$f":"'Budget Transcript page 2'!G23","v":0},{"$f":"'Budget Transcript page 2'!H23","v":0},{"$f":"'Budget Transcript page 2'!I23","v":0}," "," "," "," "," ",0,0,0,0,0,0,0," "," "," ",null,null,null,0,0,0,0,0,0,0,0,0,0,null,0,0,0,0,0,0,0,0,0,0,0,0,0]
[" ",{"$f":"IF('Budget Transcript'!$M$1=\"Y\",IF(D31>0,IF(H31>0,\"11\",\"01\"),\" \"),IF(D31>0,IF(H31>0,\"14\",\"04\"),\" \"))","v":" "},{"$f":"IF('Budget Transcript page 2'!C24=0,IF($I31<>0,C30,0),'Budget Transcript page 2'!C24)","v":0},{"$f":"IF('Budget Transcript page 2'!D24=0,IF($I31<>0,D30,0),'Budget Transcript page 2'!D24)","v":0},{"$f":"IF('Budget Transcript page 2'!E24=0,IF($I31<>0,E30,0),'Budget Transcript page 2'!E24)","v":0},{"$f":"'Budget Transcript page 2'!F24","v":0},{"$f":"'Budget Transcript page 2'!G24","v":0},{"$f":"'Budget Transcript page 2'!H24","v":0},{"$f":"'Budget Transcript page 2'!I24","v":0}," "," "," "," "," ",0,0,0,0,0,0,0," "," "," ",null,null,null,0,0,0,0,0,0,0,0,0,0,null,0,0,0,0,0,0,0,0,0,0,0,0,0]
[" ",{"$f":"IF('Budget Transcript'!$M$1=\"Y\",IF(D32>0,IF(H32>0,\"11\",\"01\"),\" \"),IF(D32>0,IF(H32>0,\"14\",\"04\"),\" \"))","v":" "},{"$f":"IF('Budget Transcript page 2'!C25=0,IF($I32<>0,C31,0),'Budget Transcript page 2'!C25)","v":0},{"$f":"IF('Budget Transcript page 2'!D25=0,IF($I32<>0,D31,0),'Budget Transcript page 2'!D25)","v":0},{"$f":"IF('Budget Transcript page 2'!E25=0,IF($I32<>0,E31,0),'Budget Transcript page 2'!E25)","v":0},{"$f":"'Budget Transcript page 2'!F25","v":0},{"$f":"'Budget Transcript page 2'!G25","v":0},{"$f":"'Budget Transcript page 2'!H25","v":0},{"$f":"'Budget Transcript page 2'!I25","v":0}," "," "," "," "," ",0,0,0,0,0,0,0," "," "," ",null,null,null,0,0,0,0,0,0,0,0,0,0,null,0,0,0,0,0,0,0,0,0,0,0,0,0]
[" ",{"$f":"IF('Budget Transcript'!$M$1=\"Y\",IF(D33>0,IF(H33>0,\"11\",\"01\"),\" \"),IF(D33>0,IF(H33>0,\"14\",\"04\"),\" \"))","v":" "},{"$f":"IF('Budget Transcript page 2'!C26=0,IF($I33<>0,C32,0),'Budget Transcript page 2'!C26)","v":0},{"$f":"IF('Budget Transcript page 2'!D26=0,IF($I33<>0,D32,0),'Budget Transcript page 2'!D26)","v":0},{"$f":"IF('Budget Transcript page 2'!E26=0,IF($I33<>0,E32,0),'Budget Transcript page 2'!E26)","v":0},{"$f":"'Budget Transcript page 2'!F26","v":0},{"$f":"'Budget Transcript page 2'!G26","v":0},{"$f":"'Budget Transcript page 2'!H26","v":0},{"$f":"'Budget Transcript page 2'!I26","v":0}," "," "," "," "," ",0,0,0,0,0,0,0," "," "," ",null,null,null,0,0,0,0,0,0,0,0,0,0,null,0,0,0,0,0,0,0,0,0,0,0,0,0]
[" ",{"$f":"IF('Budget Transcript'!$M$1=\"Y\",IF(D34>0,IF(H34>0,\"11\",\"01\"),\" \"),IF(D34>0,IF(H34>0,\"14\",\"04\"),\" \"))","v":" "},{"$f":"IF('Budget Transcript page 2'!C27=0,IF($I34<>0,C33,0),'Budget Transcript page 2'!C27)","v":0},{"$f":"IF('Budget Transcript page 2'!D27=0,IF($I34<>0,D33,0),'Budget Transcript page 2'!D27)","v":0},{"$f":"IF('Budget Transcript page 2'!E27=0,IF($I34<>0,E33,0),'Budget Transcript page 2'!E27)","v":0},{"$f":"'Budget Transcript page 2'!F27","v":0},{"$f":"'Budget Transcript page 2'!G27","v":0},{"$f":"'Budget Transcript page 2'!H27","v":0},{"$f":"'Budget Transcript page 2'!I27","v":0}," "," "," "," "," ",0,0,0,0,0,0,0," "," "," ",null,null,null,0,0,0,0,0,0,0,0,0,0,null,0,0,0,0,0,0,0,0,0,0,0,0,0]
[" ",{"$f":"IF('Budget Transcript'!$M$1=\"Y\",IF(D35>0,IF(H35>0,\"11\",\"01\"),\" \"),IF(D35>0,IF(H35>0,\"14\",\"04\"),\" \"))","v":" "},{"$f":"IF('Budget Transcript page 2'!C28=0,IF($I35<>0,C34,0),'Budget Transcript page 2'!C28)","v":0},{"$f":"IF('Budget Transcript page 2'!D28=0,IF($I35<>0,D34,0),'Budget Transcript page 2'!D28)","v":0},{"$f":"IF('Budget Transcript page 2'!E28=0,IF($I35<>0,E34,0),'Budget Transcript page 2'!E28)","v":0},{"$f":"'Budget Transcript page 2'!F28","v":0},{"$f":"'Budget Transcript page 2'!G28","v":0},{"$f":"'Budget Transcript page 2'!H28","v":0},{"$f":"'Budget Transcript page 2'!I28","v":0},{"$f":"IF(D35>0,IFERROR(VLOOKUP(D35,NCHEMS,5,0),\"ERROR\"),\" \")","v":" "},{"$f":"IF($E35>0,IFERROR(VLOOKUP($E35,ACCT,3,0),\"ERROR\"),\" \")","v":" "},{"$f":"IF($E35>0,IFERROR(VLOOKUP($E35,ACCT,5,0),\"ERROR\"),\" \")","v":" "},{"$f":"IF($E35>0,IFERROR(VLOOKUP($E35,ACCT,7,0),\"ERROR\"),\" \")","v":" "}," ",{"$f":"IF(N35<>\" \",VLOOKUP(N35,ACCT_GROUP,2,0),0)","v":0},0,0,0,0,0,0,{"$f":"IF(D35>0,VLOOKUP(D35,NCHEMS,3,0),\" \")","v":" "},{"$f":"IF(D35>0,VLOOKUP(D35,NCHEMS,4,0),\" \")","v":" "},{"$f":"IF(D35>0,VLOOKUP(D35,NCHEMS,5,0),\" \")","v":" "},null,null,null,0,0,0,0,0,0,0,0,0,0,null,0,0,0,0,0,0,0,0,0,0,0,0,0]
[" ",{"$f":"IF('Budget Transcript'!$M$1=\"Y\",IF(D36>0,IF(H36>0,\"11\",\"01\"),\" \"),IF(D36>0,IF(H36>0,\"14\",\"04\"),\" \"))","v":" "},{"$f":"IF('Budget Transcript page 2'!C29=0,IF($I36<>0,C35,0),'Budget Transcript page 2'!C29)","v":0},{"$f":"IF('Budget Transcript page 2'!D29=0,IF($I36<>0,D35,0),'Budget Transcript page 2'!D29)","v":0},{"$f":"IF('Budget Transcript page 2'!E29=0,IF($I36<>0,E35,0),'Budget Transcript page 2'!E29)","v":0},{"$f":"'Budget Transcript page 2'!F29","v":0},{"$f":"'Budget Transcript page 2'!G29","v":0},{"$f":"'Budget Transcript page 2'!H29","v":0},{"$f":"'Budget Transcript page 2'!I29","v":0}," "," "," "," "," ",0,0,0,0,0,0,0," "," "," ",null,null,null,{"$f":"IF($W36=AB$2,1,0)","v":0},0,0,0,0,0,0,0,0,0,null,{"$f":"IF($X36=AM$2,1,0)","v":0},0,0,0,0,0,0,0,0,0,0,{"$f":"IF($X36=AX$2,1,0)","v":0},0]
[" ",{"$f":"IF('Budget Transcript'!$M$1=\"Y\",IF(D37>0,IF(H37>0,\"11\",\"01\"),\" \"),IF(D37>0,IF(H37>0,\"14\",\"04\"),\" \"))","v":" "},{"$f":"IF('Budget Transcript page 2'!C30=0,IF($I37<>0,C36,0),'Budget Transcript page 2'!C30)","v":0},{"$f":"IF('Budget Transcript page 2'!D30=0,IF($I37<>0,D36,0),'Budget Transcript page 2'!D30)","v":0},{"$f":"IF('Budget Transcript page 2'!E30=0,IF($I37<>0,E36,0),'Budget Transcript page 2'!E30)","v":0},{"$f":"'Budget Transcript page 2'!F30","v":0},{"$f":"'Budget Transcript page 2'!G30","v":0},{"$f":"'Budget Transcript page 2'!H30","v":0},{"$f":"'Budget Transcript page 2'!I30","v":0}," "," "," "," "," ",0,0,0,0,0,0,0," "," "," ",null,null,null,0,0,0,0,0,0,0,0,0,0,null,0,0,0,0,0,0,0,0,0,0,0,0,0]
[" ",{"$f":"IF('Budget Transcript'!$M$1=\"Y\",IF(D38>0,IF(H38>0,\"11\",\"01\"),\" \"),IF(D38>0,IF(H38>0,\"14\",\"04\"),\" \"))","v":" "},{"$f":"IF('Budget Transcript page 2'!C31=0,IF($I38<>0,C37,0),'Budget Transcript page 2'!C31)","v":0},{"$f":"IF('Budget Transcript page 2'!D31=0,IF($I38<>0,D37,0),'Budget Transcript page 2'!D31)","v":0},{"$f":"IF('Budget Transcript page 2'!E31=0,IF($I38<>0,E37,0),'Budget Transcript page 2'!E31)","v":0},{"$f":"'Budget Transcript page 2'!F31","v":0},{"$f":"'Budget Transcript page 2'!G31","v":0},{"$f":"'Budget Transcript page 2'!H31","v":0},{"$f":"'Budget Transcript page 2'!I31","v":0}," "," "," "," "," ",0,0,0,0,0,0,0," "," "," ",null,null,null,0,0,0,0,0,0,0,0,0,0,null,0,0,0,0,0,0,0,0,0,0,0,0,0]
[" ",{"$f":"IF('Budget Transcript'!$M$1=\"Y\",IF(D39>0,IF(H39>0,\"11\",\"01\"),\" \"),IF(D39>0,IF(H39>0,\"14\",\"04\"),\" \"))","v":" "},{"$f":"IF('Budget Transcript page 2'!C32=0,IF($I39<>0,C38,0),'Budget Transcript page 2'!C32)","v":0},{"$f":"IF('Budget Transcript page 2'!D32=0,IF($I39<>0,D38,0),'Budget Transcript page 2'!D32)","v":0},{"$f":"IF('Budget Transcript page 2'!E32=0,IF($I39<>0,E38,0),'Budget Transcript page 2'!E32)","v":0},{"$f":"'Budget Transcript page 2'!F32","v":0},{"$f":"'Budget Transcript page 2'!G32","v":0},{"$f":"'Budget Transcript page 2'!H32","v":0},{"$f":"'Budget Transcript page 2'!I32","v":0}," "," "," "," "," ",0,0,0,0,0,0,0," "," "," ",null,null,null,0,0,0,0,0,0,0,0,0,0,null,0,0,0,0,0,0,0,0,0,0,0,0,0]
[" ",{"$f":"IF('Budget Transcript'!$M$1=\"Y\",IF(D40>0,IF(H40>0,\"11\",\"01\"),\" \"),IF(D40>0,IF(H40>0,\"14\",\"04\"),\" \"))","v":" "},{"$f":"IF('Budget Transcript page 2'!C33=0,IF($I40<>0,C39,0),'Budget Transcript page 2'!C33)","v":0},{"$f":"IF('Budget Transcript page 2'!D33=0,IF($I40<>0,D39,0),'Budget Transcript page 2'!D33)","v":0},{"$f":"IF('Budget Transcript page 2'!E33=0,IF($I40<>0,E39,0),'Budget Transcript page 2'!E33)","v":0},{"$f":"'Budget Transcript page 2'!F33","v":0},{"$f":"'Budget Transcript page 2'!G33","v":0},{"$f":"'Budget Transcript page 2'!H33","v":0},{"$f":"'Budget Transcript page 2'!I33","v":0}," "," "," "," "," ",0,0,0,0,0,0,0," "," "," ",null,null,null,0,0,0,0,0,0,0,0,0,0,null,0,0,0,0,0,0,0,0,0,0,0,0,0]
[" ",{"$f":"IF('Budget Transcript'!$M$1=\"Y\",IF(D41>0,IF(H41>0,\"11\",\"01\"),\" \"),IF(D41>0,IF(H41>0,\"14\",\"04\"),\" \"))","v":" "},{"$f":"IF('Budget Transcript page 2'!C34=0,IF($I41<>0,C40,0),'Budget Transcript page 2'!C34)","v":0},{"$f":"IF('Budget Transcript page 2'!D34=0,IF($I41<>0,D40,0),'Budget Transcript page 2'!D34)","v":0},{"$f":"IF('Budget Transcript page 2'!E34=0,IF($I41<>0,E40,0),'Budget Transcript page 2'!E34)","v":0},{"$f":"'Budget Transcript page 2'!F34","v":0},{"$f":"'Budget Transcript page 2'!G34","v":0},{"$f":"'Budget Transcript page 2'!H34","v":0},{"$f":"'Budget Transcript page 2'!I34","v":0}," "," "," "," "," ",0,0,0,0,0,0,0," "," "," ",null,null,null,0,0,0,0,0,0,0,0,0,0,null,0,0,0,0,0,0,0,0,0,0,0,0,0]
[" ",{"$f":"IF('Budget Transcript'!$M$1=\"Y\",IF(D42>0,IF(H42>0,\"11\",\"01\"),\" \"),IF(D42>0,IF(H42>0,\"14\",\"04\"),\" \"))","v":" "},{"$f":"IF('Budget Transcript page 2'!C35=0,IF($I42<>0,C41,0),'Budget Transcript page 2'!C35)","v":0},{"$f":"IF('Budget Transcript page 2'!D35=0,IF($I42<>0,D41,0),'Budget Transcript page 2'!D35)","v":0},{"$f":"IF('Budget Transcript page 2'!E35=0,IF($I42<>0,E41,0),'Budget Transcript page 2'!E35)","v":0},{"$f":"'Budget Transcript page 2'!F35","v":0},{"$f":"'Budget Transcript page 2'!G35","v":0},{"$f":"'Budget Transcript page 2'!H35","v":0},{"$f":"'Budget Transcript page 2'!I35","v":0}," "," "," "," "," ",0,0,0,0,0,0,0," "," "," ",null,null,null,0,0,0,0,0,0,0,0,0,0,null,0,0,0,0,0,0,0,0,0,0,0,0,0]
[" ",{"$f":"IF('Budget Transcript'!$M$1=\"Y\",IF(D43>0,IF(H43>0,\"11\",\"01\"),\" \"),IF(D43>0,IF(H43>0,\"14\",\"04\"),\" \"))","v":" "},{"$f":"'Budget Transcript page 3'!C16","v":0},{"$f":"'Budget Transcript page 3'!D16","v":0},{"$f":"'Budget Transcript page 3'!E16","v":0},{"$f":"'Budget Transcript page 3'!F16","v":0},{"$f":"'Budget Transcript page 3'!G16","v":0},{"$f":"'Budget Transcript page 3'!H16","v":0},{"$f":"'Budget Transcript page 3'!I16","v":0}," "," "," "," "," ",0,0,0,0,0,0,0," "," "," ",null,null,null,0,0,0,0,0,0,0,0,0,0,null,0,0,0,0,0,0,0,0,0,0,0,0,0]
[" ",{"$f":"IF('Budget Transcript'!$M$1=\"Y\",IF(D44>0,IF(H44>0,\"11\",\"01\"),\" \"),IF(D44>0,IF(H44>0,\"14\",\"04\"),\" \"))","v":" "},{"$f":"IF('Budget Transcript page 3'!C17=0,IF($I44<>0,C43,0),'Budget Transcript page 3'!C17)","v":0},{"$f":"IF('Budget Transcript page 3'!D17=0,IF($I44<>0,D43,0),'Budget Transcript page 3'!D17)","v":0},{"$f":"IF('Budget Transcript page 3'!E17=0,IF($I44<>0,E43,0),'Budget Transcript page 3'!E17)","v":0},{"$f":"'Budget Transcript page 3'!F17","v":0},{"$f":"'Budget Transcript page 3'!G17","v":0},{"$f":"'Budget Transcript page 3'!H17","v":0},{"$f":"'Budget Transcript page 3'!I17","v":0}," "," "," "," "," ",0,0,0,0,0,0,0," "," "," ",null,null,null,0,0,0,0,0,0,0,0,0,0,null,0,0,0,0,0,0,0,0,0,0,0,0,0]
[" ",{"$f":"IF('Budget Transcript'!$M$1=\"Y\",IF(D45>0,IF(H45>0,\"11\",\"01\"),\" \"),IF(D45>0,IF(H45>0,\"14\",\"04\"),\" \"))","v":" "},{"$f":"IF('Budget Transcript page 3'!C18=0,IF($I45<>0,C44,0),'Budget Transcript page 3'!C18)","v":0},{"$f":"IF('Budget Transcript page 3'!D18=0,IF($I45<>0,D44,0),'Budget Transcript page 3'!D18)","v":0},{"$f":"IF('Budget Transcript page 3'!E18=0,IF($I45<>0,E44,0),'Budget Transcript page 3'!E18)","v":0},{"$f":"'Budget Transcript page 3'!F18","v":0},{"$f":"'Budget Transcript page 3'!G18","v":0},{"$f":"'Budget Transcript page 3'!H18","v":0},{"$f":"'Budget Transcript page 3'!I18","v":0}," "," "," "," "," ",0,0,0,0,0,0,0," "," "," ",null,null,null,0,0,0,0,0,0,0,0,0,0,null,0,0,0,0,0,0,0,0,0,0,0,0,0]
[" ",{"$f":"IF('Budget Transcript'!$M$1=\"Y\",IF(D46>0,IF(H46>0,\"11\",\"01\"),\" \"),IF(D46>0,IF(H46>0,\"14\",\"04\"),\" \"))","v":" "},{"$f":"IF('Budget Transcript page 3'!C19=0,IF($I46<>0,C45,0),'Budget Transcript page 3'!C19)","v":0},{"$f":"IF('Budget Transcript page 3'!D19=0,IF($I46<>0,D45,0),'Budget Transcript page 3'!D19)","v":0},{"$f":"IF('Budget Transcript page 3'!E19=0,IF($I46<>0,E45,0),'Budget Transcript page 3'!E19)","v":0},{"$f":"'Budget Transcript page 3'!F19","v":0},{"$f":"'Budget Transcript page 3'!G19","v":0},{"$f":"'Budget Transcript page 3'!H19","v":0},{"$f":"'Budget Transcript page 3'!I19","v":0}," "," "," "," "," ",0,0,0,0,0,0,0," "," "," ",null,null,null,0,0,0,0,0,0,0,0,0,0,null,0,0,0,0,0,0,0,0,0,0,0,0,0]
[" ",{"$f":"IF('Budget Transcript'!$M$1=\"Y\",IF(D47>0,IF(H47>0,\"11\",\"01\"),\" \"),IF(D47>0,IF(H47>0,\"14\",\"04\"),\" \"))","v":" "},{"$f":"IF('Budget Transcript page 3'!C20=0,IF($I47<>0,C46,0),'Budget Transcript page 3'!C20)","v":0},{"$f":"IF('Budget Transcript page 3'!D20=0,IF($I47<>0,D46,0),'Budget Transcript page 3'!D20)","v":0},{"$f":"IF('Budget Transcript page 3'!E20=0,IF($I47<>0,E46,0),'Budget Transcript page 3'!E20)","v":0},{"$f":"'Budget Transcript page 3'!F20","v":0},{"$f":"'Budget Transcript page 3'!G20","v":0},{"$f":"'Budget Transcript page 3'!H20","v":0},{"$f":"'Budget Transcript page 3'!I20","v":0}," "," "," "," "," ",0,0,0,0,0,0,0," "," "," ",null,null,null,0,0,0,0,0,0,0,0,0,0,null,0,0,0,0,0,0,0,0,0,0,0,0,0]
[" ",{"$f":"IF('Budget Transcript'!$M$1=\"Y\",IF(D48>0,IF(H48>0,\"11\",\"01\"),\" \"),IF(D48>0,IF(H48>0,\"14\",\"04\"),\" \"))","v":" "},{"$f":"IF('Budget Transcript page 3'!C21=0,IF($I48<>0,C47,0),'Budget Transcript page 3'!C21)","v":0},{"$f":"IF('Budget Transcript page 3'!D21=0,IF($I48<>0,D47,0),'Budget Transcript page 3'!D21)","v":0},{"$f":"IF('Budget Transcript page 3'!E21=0,IF($I48<>0,E47,0),'Budget Transcript page 3'!E21)","v":0},{"$f":"'Budget Transcript page 3'!F21","v":0},{"$f":"'Budget Transcript page 3'!G21","v":0},{"$f":"'Budget Transcript page 3'!H21","v":0},{"$f":"'Budget Transcript page 3'!I21","v":0}," "," "," "," "," ",0,0,0,0,0,0,0," "," "," ",null,null,null,0,0,0,0,0,0,0,0,0,0,null,0,0,0,0,0,0,0,0,0,0,0,0,0]
[" ",{"$f":"IF('Budget Transcript'!$M$1=\"Y\",IF(D49>0,IF(H49>0,\"11\",\"01\"),\" \"),IF(D49>0,IF(H49>0,\"14\",\"04\"),\" \"))","v":" "},{"$f":"IF('Budget Transcript page 3'!C22=0,IF($I49<>0,C48,0),'Budget Transcript page 3'!C22)","v":0},{"$f":"IF('Budget Transcript page 3'!D22=0,IF($I49<>0,D48,0),'Budget Transcript page 3'!D22)","v":0},{"$f":"IF('Budget Transcript page 3'!E22=0,IF($I49<>0,E48,0),'Budget Transcript page 3'!E22)","v":0},{"$f":"'Budget Transcript page 3'!F22","v":0},{"$f":"'Budget Transcript page 3'!G22","v":0},{"$f":"'Budget Transcript page 3'!H22","v":0},{"$f":"'Budget Transcript page 3'!I22","v":0}," "," "," "," "," ",0,0,0,0,0,0,0," "," "," ",null,null,null,0,0,0,0,0,0,0,0,0,0,null,0,0,0,0,0,0,0,0,0,0,0,0,0]
[" ",{"$f":"IF('Budget Transcript'!$M$1=\"Y\",IF(D50>0,IF(H50>0,\"11\",\"01\"),\" \"),IF(D50>0,IF(H50>0,\"14\",\"04\"),\" \"))","v":" "},{"$f":"IF('Budget Transcript page 3'!C23=0,IF($I50<>0,C49,0),'Budget Transcript page 3'!C23)","v":0},{"$f":"IF('Budget Transcript page 3'!D23=0,IF($I50<>0,D49,0),'Budget Transcript page 3'!D23)","v":0},{"$f":"IF('Budget Transcript page 3'!E23=0,IF($I50<>0,E49,0),'Budget Transcript page 3'!E23)","v":0},{"$f":"'Budget Transcript page 3'!F23","v":0},{"$f":"'Budget Transcript page 3'!G23","v":0},{"$f":"'Budget Transcript page 3'!H23","v":0},{"$f":"'Budget Transcript page 3'!I23","v":0}," "," "," "," "," ",0,0,0,0,0,0,0," "," "," ",null,null,null,0,0,0,0,0,0,0,0,0,0,null,0,0,0,0,0,0,0,0,0,0,0,0,0]
[" ",{"$f":"IF('Budget Transcript'!$M$1=\"Y\",IF(D51>0,IF(H51>0,\"11\",\"01\"),\" \"),IF(D51>0,IF(H51>0,\"14\",\"04\"),\" \"))","v":" "},{"$f":"IF('Budget Transcript page 3'!C24=0,IF($I51<>0,C50,0),'Budget Transcript page 3'!C24)","v":0},{"$f":"IF('Budget Transcript page 3'!D24=0,IF($I51<>0,D50,0),'Budget Transcript page 3'!D24)","v":0},{"$f":"IF('Budget Transcript page 3'!E24=0,IF($I51<>0,E50,0),'Budget Transcript page 3'!E24)","v":0},{"$f":"'Budget Transcript page 3'!F24","v":0},{"$f":"'Budget Transcript page 3'!G24","v":0},{"$f":"'Budget Transcript page 3'!H24","v":0},{"$f":"'Budget Transcript page 3'!I24","v":0}," "," "," "," "," ",0,0,0,0,0,0,0," "," "," ",null,null,null,0,0,0,0,0,0,0,0,0,0,null,0,0,0,0,0,0,0,0,0,0,0,0,0]
[" ",{"$f":"IF('Budget Transcript'!$M$1=\"Y\",IF(D52>0,IF(H52>0,\"11\",\"01\"),\" \"),IF(D52>0,IF(H52>0,\"14\",\"04\"),\" \"))","v":" "},{"$f":"IF('Budget Transcript page 3'!C25=0,IF($I52<>0,C51,0),'Budget Transcript page 3'!C25)","v":0},{"$f":"IF('Budget Transcript page 3'!D25=0,IF($I52<>0,D51,0),'Budget Transcript page 3'!D25)","v":0},{"$f":"IF('Budget Transcript page 3'!E25=0,IF($I52<>0,E51,0),'Budget Transcript page 3'!E25)","v":0},{"$f":"'Budget Transcript page 3'!F25","v":0},{"$f":"'Budget Transcript page 3'!G25","v":0},{"$f":"'Budget Transcript page 3'!H25","v":0},{"$f":"'Budget Transcript page 3'!I25","v":0}," "," "," "," "," ",0,0,0,0,0,0,0," "," "," ",null,null,null,{"$f":"IF($W52=AB$2,1,0)","v":0},0,0,0,0,0,0,0,0,0,null,0,0,0,0,0,0,0,0,0,0,0,0,0]
[" ",{"$f":"IF('Budget Transcript'!$M$1=\"Y\",IF(D53>0,IF(H53>0,\"11\",\"01\"),\" \"),IF(D53>0,IF(H53>0,\"14\",\"04\"),\" \"))","v":" "},{"$f":"IF('Budget Transcript page 3'!C26=0,IF($I53<>0,C52,0),'Budget Transcript page 3'!C26)","v":0},{"$f":"IF('Budget Transcript page 3'!D26=0,IF($I53<>0,D52,0),'Budget Transcript page 3'!D26)","v":0},{"$f":"IF('Budget Transcript page 3'!E26=0,IF($I53<>0,E52,0),'Budget Transcript page 3'!E26)","v":0},{"$f":"'Budget Transcript page 3'!F26","v":0},{"$f":"'Budget Transcript page 3'!G26","v":0},{"$f":"'Budget Transcript page 3'!H26","v":0},{"$f":"'Budget Transcript page 3'!I26","v":0}," "," "," "," "," ",0,0,0,0,0,0,0," "," "," ",null,null,null,0,0,0,0,0,0,0,0,0,0,null,0,0,0,0,0,0,0,0,0,0,0,0,0]
[" ",{"$f":"IF('Budget Transcript'!$M$1=\"Y\",IF(D54>0,IF(H54>0,\"11\",\"01\"),\" \"),IF(D54>0,IF(H54>0,\"14\",\"04\"),\" \"))","v":" "},{"$f":"IF('Budget Transcript page 3'!C27=0,IF($I54<>0,C53,0),'Budget Transcript page 3'!C27)","v":0},{"$f":"IF('Budget Transcript page 3'!D27=0,IF($I54<>0,D53,0),'Budget Transcript page 3'!D27)","v":0},{"$f":"IF('Budget Transcript page 3'!E27=0,IF($I54<>0,E53,0),'Budget Transcript page 3'!E27)","v":0},{"$f":"'Budget Transcript page 3'!F27","v":0},{"$f":"'Budget Transcript page 3'!G27","v":0},{"$f":"'Budget Transcript page 3'!H27","v":0},{"$f":"'Budget Transcript page 3'!I27","v":0}," "," "," "," "," ",0,0,0,0,0,0,0," "," "," ",null,null,null,0,0,0,0,0,0,0,0,0,0,null,0,0,0,0,0,0,0,0,0,0,0,0,0]
[" ",{"$f":"IF('Budget Transcript'!$M$1=\"Y\",IF(D55>0,IF(H55>0,\"11\",\"01\"),\" \"),IF(D55>0,IF(H55>0,\"14\",\"04\"),\" \"))","v":" "},{"$f":"IF('Budget Transcript page 3'!C28=0,IF($I55<>0,C54,0),'Budget Transcript page 3'!C28)","v":0},{"$f":"IF('Budget Transcript page 3'!D28=0,IF($I55<>0,D54,0),'Budget Transcript page 3'!D28)","v":0},{"$f":"IF('Budget Transcript page 3'!E28=0,IF($I55<>0,E54,0),'Budget Transcript page 3'!E28)","v":0},{"$f":"'Budget Transcript page 3'!F28","v":0},{"$f":"'Budget Transcript page 3'!G28","v":0},{"$f":"'Budget Transcript page 3'!H28","v":0},{"$f":"'Budget Transcript page 3'!I28","v":0}," "," "," "," "," ",0,0,0,0,0,0,0," "," "," ",null,null,null,0,0,0,0,0,0,0,0,0,0,null,0,0,0,0,0,0,0,0,0,0,0,0,0]
[" ",{"$f":"IF('Budget Transcript'!$M$1=\"Y\",IF(D56>0,IF(H56>0,\"11\",\"01\"),\" \"),IF(D56>0,IF(H56>0,\"14\",\"04\"),\" \"))","v":" "},{"$f":"IF('Budget Transcript page 3'!C29=0,IF($I56<>0,C55,0),'Budget Transcript page 3'!C29)","v":0},{"$f":"IF('Budget Transcript page 3'!D29=0,IF($I56<>0,D55,0),'Budget Transcript page 3'!D29)","v":0},{"$f":"IF('Budget Transcript page 3'!E29=0,IF($I56<>0,E55,0),'Budget Transcript page 3'!E29)","v":0},{"$f":"'Budget Transcript page 3'!F29","v":0},{"$f":"'Budget Transcript page 3'!G29","v":0},{"$f":"'Budget Transcript page 3'!H29","v":0},{"$f":"'Budget Transcript page 3'!I29","v":0}," "," "," "," "," ",0,0,0,0,0,0,0," "," "," ",null,null,null,0,0,0,0,0,0,0,0,0,0,null,0,0,0,0,0,0,0,0,0,0,0,0,0]
[" ",{"$f":"IF('Budget Transcript'!$M$1=\"Y\",IF(D57>0,IF(H57>0,\"11\",\"01\"),\" \"),IF(D57>0,IF(H57>0,\"14\",\"04\"),\" \"))","v":" "},{"$f":"IF('Budget Transcript page 3'!C30=0,IF($I57<>0,C56,0),'Budget Transcript page 3'!C30)","v":0},{"$f":"IF('Budget Transcript page 3'!D30=0,IF($I57<>0,D56,0),'Budget Transcript page 3'!D30)","v":0},{"$f":"IF('Budget Transcript page 3'!E30=0,IF($I57<>0,E56,0),'Budget Transcript page 3'!E30)","v":0},{"$f":"'Budget Transcript page 3'!F30","v":0},{"$f":"'Budget Transcript page 3'!G30","v":0},{"$f":"'Budget Transcript page 3'!H30","v":0},{"$f":"'Budget Transcript page 3'!I30","v":0}," "," "," "," "," ",0,0,0,0,0,0,0," "," "," ",null,null,null,0,0,0,0,0,0,0,0,0,0,null,0,0,0,0,0,0,0,0,0,0,0,0,0]
[" ",{"$f":"IF('Budget Transcript'!$M$1=\"Y\",IF(D58>0,IF(H58>0,\"11\",\"01\"),\" \"),IF(D58>0,IF(H58>0,\"14\",\"04\"),\" \"))","v":" "},{"$f":"IF('Budget Transcript page 3'!C31=0,IF($I58<>0,C57,0),'Budget Transcript page 3'!C31)","v":0},{"$f":"IF('Budget Transcript page 3'!D31=0,IF($I58<>0,D57,0),'Budget Transcript page 3'!D31)","v":0},{"$f":"IF('Budget Transcript page 3'!E31=0,IF($I58<>0,E57,0),'Budget Transcript page 3'!E31)","v":0},{"$f":"'Budget Transcript page 3'!F31","v":0},{"$f":"'Budget Transcript page 3'!G31","v":0},{"$f":"'Budget Transcript page 3'!H31","v":0},{"$f":"'Budget Transcript page 3'!I31","v":0}," "," "," "," "," ",0,0,0,0,0,0,0," "," "," ",null,null,null,0,0,0,0,0,0,0,0,0,0,null,0,0,0,0,0,0,0,0,0,0,0,0,0]
[" ",{"$f":"IF('Budget Transcript'!$M$1=\"Y\",IF(D59>0,IF(H59>0,\"11\",\"01\"),\" \"),IF(D59>0,IF(H59>0,\"14\",\"04\"),\" \"))","v":" "},{"$f":"IF('Budget Transcript page 3'!C32=0,IF($I59<>0,C58,0),'Budget Transcript page 3'!C32)","v":0},{"$f":"IF('Budget Transcript page 3'!D32=0,IF($I59<>0,D58,0),'Budget Transcript page 3'!D32)","v":0},{"$f":"IF('Budget Transcript page 3'!E32=0,IF($I59<>0,E58,0),'Budget Transcript page 3'!E32)","v":0},{"$f":"'Budget Transcript page 3'!F32","v":0},{"$f":"'Budget Transcript page 3'!G32","v":0},{"$f":"'Budget Transcript page 3'!H32","v":0},{"$f":"'Budget Transcript page 3'!I32","v":0}," "," "," "," "," ",0,0,0,0,0,0,0," "," "," ",null,null,null,0,0,0,0,0,0,0,0,0,0,null,0,0,{"$f":"IF($X59=AO$2,1,0)","v":0},0,0,0,0,0,0,0,0,0,0]
[" ",{"$f":"IF('Budget Transcript'!$M$1=\"Y\",IF(D60>0,IF(H60>0,\"11\",\"01\"),\" \"),IF(D60>0,IF(H60>0,\"14\",\"04\"),\" \"))","v":" "},{"$f":"IF('Budget Transcript page 3'!C33=0,IF($I60<>0,C59,0),'Budget Transcript page 3'!C33)","v":0},{"$f":"IF('Budget Transcript page 3'!D33=0,IF($I60<>0,D59,0),'Budget Transcript page 3'!D33)","v":0},{"$f":"IF('Budget Transcript page 3'!E33=0,IF($I60<>0,E59,0),'Budget Transcript page 3'!E33)","v":0},{"$f":"'Budget Transcript page 3'!F33","v":0},{"$f":"'Budget Transcript page 3'!G33","v":0},{"$f":"'Budget Transcript page 3'!H33","v":0},{"$f":"'Budget Transcript page 3'!I33","v":0}," "," "," "," "," ",0,0,0,0,0,0,0," "," "," ",null,null,null,0,0,0,0,0,0,0,0,0,0,null,{"$f":"IF($X60=AM$2,1,0)","v":0},0,0,0,0,0,0,0,0,0,0,0,0]
[" ",{"$f":"IF('Budget Transcript'!$M$1=\"Y\",IF(D61>0,IF(H61>0,\"11\",\"01\"),\" \"),IF(D61>0,IF(H61>0,\"14\",\"04\"),\" \"))","v":" "},{"$f":"IF('Budget Transcript page 3'!C34=0,IF($I61<>0,C60,0),'Budget Transcript page 3'!C34)","v":0},{"$f":"IF('Budget Transcript page 3'!D34=0,IF($I61<>0,D60,0),'Budget Transcript page 3'!D34)","v":0},{"$f":"IF('Budget Transcript page 3'!E34=0,IF($I61<>0,E60,0),'Budget Transcript page 3'!E34)","v":0},{"$f":"'Budget Transcript page 3'!F34","v":0},{"$f":"'Budget Transcript page 3'!G34","v":0},{"$f":"'Budget Transcript page 3'!H34","v":0},{"$f":"'Budget Transcript page 3'!I34","v":0}," "," "," "," "," ",0,0,0,0,0,0,0," "," "," ",null,null,null,0,0,0,0,0,0,0,0,0,0,null,0,0,0,0,0,0,0,0,0,0,0,0,0]
[" ",{"$f":"IF('Budget Transcript'!$M$1=\"Y\",IF(D62>0,IF(H62>0,\"11\",\"01\"),\" \"),IF(D62>0,IF(H62>0,\"14\",\"04\"),\" \"))","v":" "},{"$f":"IF('Budget Transcript page 3'!C35=0,IF($I62<>0,C61,0),'Budget Transcript page 3'!C35)","v":0},{"$f":"IF('Budget Transcript page 3'!D35=0,IF($I62<>0,D61,0),'Budget Transcript page 3'!D35)","v":0},{"$f":"IF('Budget Transcript page 3'!E35=0,IF($I62<>0,E61,0),'Budget Transcript page 3'!E35)","v":0},{"$f":"'Budget Transcript page 3'!F35","v":0},{"$f":"'Budget Transcript page 3'!G35","v":0},{"$f":"'Budget Transcript page 3'!H35","v":0},{"$f":"'Budget Transcript page 3'!I35","v":0}," "," "," "," "," ",0,0,0,0,0,0,0," "," "," ",null,null,null,0,0,0,0,0,0,0,0,0,0,null,0,0,0,0,0,0,0,0,0,0,0,0,0]

{"sheet":"NCHEMS","index":6,"n_rows":5000,"n_cols":26,"rows_kept":5000,"cut":false,"hidden":true,"merged":[[0,23,0,25],[0,14,0,15],[0,0,0,2],[0,11,0,13],[0,18,0,19],[0,20,0,22]]}
["DO NOT MODIFY",null,null,null,null,null,null,null,null,null,null,"DO NOT MODIFY",null,null,"DO NOT MODIFY",null,null,null,"DO NOT MODIFY",null,"DO NOT MODIFY",null,null,"DO NOT MODIFY"]
["ORG","Program Code","ALLOC-NCHEMS","ALLOC ABBR","NCHEMS ABBR","ORGN","PROG_CODE_DEF","PROG_LEVEL3","PROG_LEVEL2",null,null,"Program Code","NCHEMS Category","ABBR","Level 3","Level 3 Title","Level 2","Level 2 Title","NCHEMS Category","ABBR","Allocation","Allocation Code","ABBR","ABBR","Allocation","BR Prefix"]
[{"$f":"IF(F3>0,VALUE(F3),\" \")","v":31128},{"$f":"IF(A3<>\" \",RIGHT(G3,2),\" \")","v":"ID"},{"$f":"IF(A3<>\" \",VLOOKUP(H3,ALLOC_NCHEMS,2,0),\" \")","v":"FC Instruction"},{"$f":"IF(A3<>\" \",VLOOKUP(I3,ALLOC,2,0),\" \")","v":"FC"},{"$f":"IF(A3<>\" \",VLOOKUP(B3,NCHEMS_ABBR,3,0),\" \")","v":"I"},31128,"3011ID",301000,300001,null,null,"AC","Academic Support",{"$f":"VLOOKUP(M3,NCHEMS_Category,2,0)","v":"AS"},37000,"96 CEA Suppl - PP",307100,"96 CEA Suppl","Academic Support","AS","Bristol Bay Campus Allocation",200003,"BBC","BBC","Bristol Bay Campus Allocation","FBB"]
[40000,{"$f":"IF(A4<>\" \",RIGHT(G4,2),\" \")","v":"GA"},{"$f":"IF(A4<>\" \",VLOOKUP(H4,ALLOC_NCHEMS,2,0),\" \")","v":"FC Institutional Support"},"FC","IS",40000,"3062GA",306000,300001,null,null,"AL","Library Services","L","210X00","BBC Unallocated Authority",200003,"Bristol Bay Campus Allocation","Auxiliary Enterprises","AUX","Chukchi Campus Allocation",200004,"CC","CC","Chukchi Campus Allocation","FCC"]
[40001,"GA","FC Institutional Support","FC","IS",40001,"3062GA",306000,300001,null,null,"AM","Academic Support","AS",211000,"BBC Instruction",200003,"Bristol Bay Campus Allocation","Debt Service","DS","Co-op Extension Svcs Allocation",200001,"CES","CES","Co-op Extension Svcs Allocation","FAC"]
[40002,"GA","FC Institutional Support","FC","IS",40002,"3062GA",306000,300001,null,null,"AP","Academic Support","AS",213000,"BBC Public Service",200003,"Bristol Bay Campus Allocation","Institutional Support","IS","Fairbanks Campus Allocation",300001,"FC","FC","Fairbanks Campus Allocation","FFS"]
[40003,"GA","FC Institutional Support","FC","IS",40003,"3062GA",306000,300001,null,null,"AS","Academic Support","AS",214000,"BBC Academic Support",200003,"Bristol Bay Campus Allocation","Instruction","I","Interior Campus Allocation",300003,"IC","IC","Interior Campus Allocation","FIC"]
[40004,"PS","FC Public Service","FC","PS",40004,"3062PS",303000,300001,null,null,"AY","Academic Support","AS",215000,"BBC Student Services",200003,"Bristol Bay Campus Allocation","Intercollegiate Athletics","A","Kuskokwim Campus Allocation",300004,"KC","KC","Kuskokwim Campus Allocation","FKC"]
[40005,"GA","FC Institutional Support","FC","IS",40005,"3062GA",306000,300001,null,null,"AZ","Academic Support","AS",216000,"BBC Institutional Support",200003,"Bristol Bay Campus Allocation","Library Services","L","Northwest Campus Allocation",300005,"NC","NC","Northwest Campus Allocation","FNW"]
[40006,"GZ","FC Institutional Support","FC","IS",40006,"3063GZ",306000,300001,null,null,"DS","Debt Service","DS",217000,"BBC Physical Plant",200003,"Bristol Bay Campus Allocation","Operations & Maintenance","PP","Rural College Allocation",300006,"RC","RC","Rural College Allocation","FRC"]
[40007,"GA","FC Institutional Support","FC","IS",40007,"3062GA",306000,300001,null,null,"FA","Scholarships & Fellowships","FA",218000,"BBC Scholarships",200003,"Bristol Bay Campus Allocation","Public Service","PS","UAF Comm Tech College Allocation",300010,"CTC","CTC","UAF Comm Tech College Allocation","FCT"]
[40008,"GA","FC Institutional Support","FC","IS",40008,"3062GA",306000,300001,null,null,"GA","Institutional Support","IS",219000,"BBC Auxiliary Services",200003,"Bristol Bay Campus Allocation","Research","R","UAF Organized Research Allocation",300002,"FOR","FOR","UAF Organized Research Allocation","FOR"]
[40009,"GZ","FC Institutional Support","FC","IS",40009,"3062GZ",306000,300001,null,null,"GB","Institutional Support","IS","220X00","IC Unallocated Authority",300003,"Interior Campus Allocation","Scholarships & Fellowships","FA"]
[40010,"GY","FC Institutional Support","FC","IS",40010,"306AGY",306000,300001,null,null,"GM","Institutional Support","IS",221000,"IC Instruction",300003,"Interior Campus Allocation","Student Services","SS"]
[40011,"GA","FC Institutional Support","FC","IS",40011,"3062GA",306000,300001,null,null,"GP","Institutional Support","IS",222000,"IC Research",300003,"Interior Campus Allocation","Unallocated Authority","U"]
[40012,"GZ","FC Institutional Support","FC","IS",40012,"3062GZ",306000,300001,null,null,"GS","Institutional Support","IS",223000,"IC Public Service",300003,"Interior Campus Allocation"]
[40013,"PD","FC Public Service","FC","PS",40013,"303BPD",303000,300001,null,null,"GY","Institutional Support","IS",224000,"IC Academic Support",300003,"Interior Campus Allocation"]
[40014,"GZ","FC Institutional Support","FC","IS",40014,"3063GZ",306000,300001,null,null,"GZ","Institutional Support","IS",225000,"IC Student Services",300003,"Interior Campus Allocation"]
[40015,"GZ","FC Institutional Support","FC","IS",40015,"3063GZ",306000,300001,null,null,"ID","Instruction","I",226000,"IC Institutional Support",300003,"Interior Campus Allocation"]
[40016,"GA","FC Institutional Support","FC","IS",40016,"3062GA",306000,300001,null,null,"IM","Instruction","I",227000,"IC Physical Plant",300003,"Interior Campus Allocation"]
[40017,"FA","FC Scholarships","FC","FA",40017,"3062FA",308000,300001,null,null,"IN","Instruction","I",228000,"IC Scholarships",300003,"Interior Campus Allocation"]
[40018,"GZ","FC Institutional Support","FC","IS",40018,"3063GZ",306000,300001,null,null,"IR","Instruction","I",229000,"IC Auxiliary Services",300003,"Interior Campus Allocation"]
[40019,"GZ","FC Institutional Support","FC","IS",40019,"3063GZ",306000,300001,null,null,"IY","Instruction","I","300X00","FC Unallocated Authority",300001,"Fairbanks Campus Allocation"]
[40020,"GZ","FC Institutional Support","FC","IS",40020,"3063GZ",306000,300001,null,null,"IZ","Instruction","I",301000,"FC Instruction",300001,"Fairbanks Campus Allocation"]
[40021,"GZ","FC Institutional Support","FC","IS",40021,"3062GZ",306000,300001,null,null,"NA","Unallocated Authority","U",302000,"FC Research",300001,"Fairbanks Campus Allocation"]
[40022,"GZ","FC Institutional Support","FC","IS",40022,"3063GZ",306000,300001,null,null,"OM","Operations & Maintenance","PP",303000,"FC Public Service",300001,"Fairbanks Campus Allocation"]
[40023,"GZ","FC Institutional Support","FC","IS",40023,"3062GZ",306000,300001,null,null,"OY","Operations & Maintenance","PP",304000,"FC Academic Support",300001,"Fairbanks Campus Allocation"]
[40024,"GZ","FC Institutional Support","FC","IS",40024,"3062GZ",306000,300001,null,null,"OZ","Operations & Maintenance","PP",304500,"FC Library Services",300001,"Fairbanks Campus Allocation"]
[40025,"GZ","FC Institutional Support","FC","IS",40025,"3062GZ",306000,300001,null,null,"PD","Public Service","PS",305000,"FC Student Services",300001,"Fairbanks Campus Allocation"]
[40026,"GZ","FC Institutional Support","FC","IS",40026,"3062GZ",306000,300001,null,null,"PM","Public Service","PS",305500,"FC Intercollegiate Athl",300001,"Fairbanks Campus Allocation"]
[40027,"GZ","FC Institutional Support","FC","IS",40027,"3062GZ",306000,300001,null,null,"PS","Public Service","PS",306000,"FC Institutional Support",300001,"Fairbanks Campus Allocation"]
[40028,"GZ","FC Institutional Support","FC","IS",40028,"3062GZ",306000,300001,null,null,"PY","Public Service","PS",307000,"FC Physical Plant",300001,"Fairbanks Campus Allocation"]
[40029,"GZ","FC Institutional Support","FC","IS",40029,"3062GZ",306000,300001,null,null,"PZ","Public Service","PS",308000,"FC Scholarships",300001,"Fairbanks Campus Allocation"]
[40030,"GZ","FC Institutional Support","FC","IS",40030,"3062GZ",306000,300001,null,null,"RD","Research","R",309000,"FC Auxiliary Services",300001,"Fairbanks Campus Allocation"]
[40031,"GS","FC Institutional Support","FC","IS",40031,"3062GS",306000,300001,null,null,"RM","Research","R","320X00","RC Unallocated Authority",300006,"Rural College Allocation"]
[40032,"IN","FC Instruction","FC","I",40032,"301VIN",301000,300001,null,null,"RO","Research","R",321000,"RC Instruction",300006,"Rural College Allocation"]
[40033,"GA","FC Institutional Support","FC","IS",40033,"3062GA",306000,300001,null,null,"RR","Research","R",322000,"RC Research",300006,"Rural College Allocation"]
[40040,"PS","FC Public Service","FC","PS",40040,"3062PS",303000,300001,null,null,"RT","Research","R",323000,"RC Public Service",300006,"Rural College Allocation"]
[40041,"PS","FC Public Service","FC","PS",40041,"3062PS",303000,300001,null,null,"RY","Research","R",324000,"RC Academic Support",300006,"Rural College Allocation"]
[41000,"FA","FC Scholarships","FC","FA",41000,"3080FA",308000,300001,null,null,"RZ","Research","R",325000,"RC Student Services",300006,"Rural College Allocation"]
[41001,"FA","FC Scholarships","FC","FA",41001,"3080FA",308000,300001,null,null,"SA","Intercollegiate Athletics","A",326000,"RC Institutional Supt",300006,"Rural College Allocation"]
[41002,"FA","FC Scholarships","FC","FA",41002,"3080FA",308000,300001,null,null,"SS","Student Services","SS",327000,"RC Physical Plant",300006,"Rural College Allocation"]
[41003,"FA","FC Scholarships","FC","FA",41003,"3080FA",308000,300001,null,null,"SY","Student Services","SS",328000,"RC Student Loans & Schol",300006,"Rural College Allocation"]
[41004,"FA","FC Scholarships","FC","FA",41004,"3080FA",308000,300001,null,null,"SZ","Student Services","SS",329000,"RC Auxiliary Service",300006,"Rural College Allocation"]
[41005,"FA","FC Scholarships","FC","FA",41005,"3080FA",308000,300001,null,null,"UM","Auxiliary Enterprises","AUX","330X00","CES Unallocated Authority",200001,"Co-op Extension Svcs Allocation"]
[41006,"FA","FC Scholarships","FC","FA",41006,"3080FA",308000,300001,null,null,"UR","Auxiliary Enterprises","AUX",331000,"CES Instruction",200001,"Co-op Extension Svcs Allocation"]
[41007,"FA","FC Scholarships","FC","FA",41007,"3080FA",308000,300001,null,null,"UX","Auxiliary Enterprises","AUX",332000,"CES Research",200001,"Co-op Extension Svcs Allocation"]
[41008,"FA","FC Scholarships","FC","FA",41008,"3080FA",308000,300001,null,null,"UZ","Auxiliary Enterprises","AUX",333000,"CES Public Services",200001,"Co-op Extension Svcs Allocation"]
[41009,"FA","FC Scholarships","FC","FA",41009,"3080FA",308000,300001,null,null,null,null,null,336000,"CES Institutional Support",200001,"Co-op Extension Svcs Allocation"]
[41010,"FA","FC Scholarships","FC","FA",41010,"3080FA",308000,300001,null,null,null,null,null,338000,"CES Student Aid",200001,"Co-op Extension Svcs Allocation"]
[41011,"FA","FC Scholarships","FC","FA",41011,"3080FA",308000,300001,null,null,null,null,null,"340X00","KC Unallocated Authority",300004,"Kuskokwim Campus Allocation"]
[{"$f":"IF(F52>0,VALUE(F52),\" \")","v":41012},{"$f":"IF(A52<>\" \",RIGHT(G52,2),\" \")","v":"SA"},{"$f":"IF(A52<>\" \",VLOOKUP(H52,ALLOC_NCHEMS,2,0),\" \")","v":"FC Intercollegiate Athl"},{"$f":"IF(A52<>\" \",VLOOKUP(I52,ALLOC,2,0),\" \")","v":"FC"},"A",41012,"3054SA",305500,300001,null,null,null,null,null,341000,"KC Instruction",300004,"Kuskokwim Campus Allocation"]
[41013,"SZ","FC Intercollegiate Athl","FC","SS",41013,"3054SZ",305500,300001,null,null,null,null,null,342000,"KC Research",300004,"Kuskokwim Campus Allocation"]
[41014,"SZ","FC Intercollegiate Athl","FC","SS",41014,"3054SZ",305500,300001,null,null,null,null,null,343000,"KC Public Service",300004,"Kuskokwim Campus Allocation"]
[41015,"SZ","FC Intercollegiate Athl","FC","SS",41015,"3054SZ",305500,300001,null,null,null,null,null,344000,"KC Academic Support",300004,"Kuskokwim Campus Allocation"]
[41016,"SZ","FC Intercollegiate Athl","FC","SS",41016,"3054SZ",305500,300001,null,null,null,null,null,344500,"KC Library Services",300004,"Kuskokwim Campus Allocation"]
[41017,"SZ","FC Intercollegiate Athl","FC","SS",41017,"3054SZ",305500,300001,null,null,null,null,null,345000,"KC Student Services",300004,"Kuskokwim Campus Allocation"]
[41018,"SZ","FC Intercollegiate Athl","FC","SS",41018,"3054SZ",305500,300001,null,null,null,null,null,346000,"KC Institutional Support",300004,"Kuskokwim Campus Allocation"]
[41019,"SZ","FC Intercollegiate Athl","FC","SS",41019,"3054SZ",305500,300001,null,null,null,null,null,347000,"KC Physical Plant",300004,"Kuskokwim Campus Allocation"]
[41020,"SZ","FC Intercollegiate Athl","FC","SS",41020,"3054SZ",305500,300001,null,null,null,null,null,348000,"KC Scholarships",300004,"Kuskokwim Campus Allocation"]
[41021,"SS","FC Student Services","FC","SS",41021,"3051SS",305000,300001,null,null,null,null,null,349000,"KC Auxiliary Services",300004,"Kuskokwim Campus Allocation"]
[41022,"SS","FC Student Services","FC","SS",41022,"3051SS",305000,300001,null,null,null,null,null,"350X00","NC Unallocated Authority",300005,"Northwest Campus Allocation"]
[41023,"FA","FC Scholarships","FC","FA",41023,"308AFA",308000,300001,null,null,null,null,null,351000,"NC Instruction",300005,"Northwest Campus Allocation"]
[41024,"FA","FC Scholarships","FC","FA",41024,"308AFA",308000,300001,null,null,null,null,null,352000,"NC Research",300005,"Northwest Campus Allocation"]
[41025,"PS","FC Public Service","FC","PS",41025,"3037PS",303000,300001,null,null,null,null,null,353000,"NC Public Service",300005,"Northwest Campus Allocation"]
[41026,"UM","FC Auxiliary Services","FC","AUX",41026,"3090UM",309000,300001,null,null,null,null,null,354000,"NC Academic Support",300005,"Northwest Campus Allocation"]
[41027,"UX","FC Auxiliary Services","FC",{"$f":"IF(A67<>\" \",VLOOKUP(B67,NCHEMS_ABBR,3,0),\" \")","v":"AUX"},41027,"3092UX",309000,300001,null,null,null,null,null,354500,"NC Library Services",300005,"Northwest Campus Allocation"]
[41028,"UX","FC Auxiliary Services","FC","AUX",41028,"3092UX",309000,300001,null,null,null,null,null,355000,"NC Student Services",300005,"Northwest Campus Allocation"]
[41029,"UX","FC Auxiliary Services","FC","AUX",41029,"3092UX",309000,300001,null,null,null,null,null,356000,"NC Institutional Support",300005,"Northwest Campus Allocation"]
[41030,"UX","FC Auxiliary Services","FC","AUX",41030,"3092UX",309000,300001,null,null,null,null,null,357000,"NC Physical Plant",300005,"Northwest Campus Allocation"]
[41031,"UX","FC Auxiliary Services","FC","AUX",41031,"3092UX",309000,300001,null,null,null,null,null,358000,"NC Scholarships",300005,"Northwest Campus Allocation"]
[41032,"UX","FC Auxiliary Services","FC","AUX",41032,"3092UX",309000,300001,null,null,null,null,null,359000,"NC Auxiliary Services",300005,"Northwest Campus Allocation"]
[41033,"UX","FC Auxiliary Services","FC","AUX",41033,"3092UX",309000,300001,null,null,null,null,null,"360X00","CTC Unallocated Authority",300010,"UAF Comm Tech College Allocation"]
[41034,"UX","FC Auxiliary Services","FC","AUX",41034,"3092UX",309000,300001,null,null,null,null,null,361000,"CTC Instruction",300010,"UAF Comm Tech College Allocation"]
[41035,"UX","FC Auxiliary Services","FC","AUX",41035,"3092UX",309000,300001,null,null,null,null,null,363000,"CTC Public Service",300010,"UAF Comm Tech College Allocation"]
[41036,"UX","FC Auxiliary Services","FC","AUX",41036,"3092UX",309000,300001,null,null,null,null,null,364000,"CTC Academic Support",300010,"UAF Comm Tech College Allocation"]
[41037,"UX","FC Auxiliary Services","FC","AUX",41037,"3092UX",309000,300001,null,null,null,null,null,365000,"CTC Student Services",300010,"UAF Comm Tech College Allocation"]
[41038,"UX","FC Auxiliary Services","FC","AUX",41038,"3092UX",309000,300001,null,null,null,null,null,366000,"CTC Institutional Support",300010,"UAF Comm Tech College Allocation"]
[41039,"UX","FC Auxiliary Services","FC","AUX",41039,"3092UX",309000,300001,null,null,null,null,null,367000,"CTC Physical Plant",300010,"UAF Comm Tech College Allocation"]
[41040,"UX","FC Auxiliary Services","FC","AUX",41040,"3092UX",309000,300001,null,null,null,null,null,368000,"CTC Scholarships",300010,"UAF Comm Tech College Allocation"]
[41041,"UX","FC Auxiliary Services","FC","AUX",41041,"3092UX",309000,300001,null,null,null,null,null,"370X00","CC Unallocated Authority",200004,"Chukchi Campus Allocation"]
[41042,"UX","FC Auxiliary Services","FC","AUX",41042,"3092UX",309000,300001,null,null,null,null,null,371000,"CC Instruction",200004,"Chukchi Campus Allocation"]
[41043,"UX","FC Auxiliary Services","FC","AUX",41043,"3092UX",309000,300001,null,null,null,null,null,373000,"CC Public Service",200004,"Chukchi Campus Allocation"]
[41044,"UX","FC Auxiliary Services","FC","AUX",41044,"3092UX",309000,300001,null,null,null,null,null,374000,"CC Academic Support",200004,"Chukchi Campus Allocation"]
[41045,"UX","FC Auxiliary Services","FC","AUX",41045,"3092UX",309000,300001,null,null,null,null,null,374500,"CC Library Services",200004,"Chukchi Campus Allocation"]
[41046,"UX","FC Auxiliary Services","FC","AUX",41046,"3092UX",309000,300001,null,null,null,null,null,375000,"CC Student Services",200004,"Chukchi Campus Allocation"]
[41047,"UX","FC Auxiliary Services","FC","AUX",41047,"3092UX",309000,300001,null,null,null,null,null,376000,"CC Institutional Support",200004,"Chukchi Campus Allocation"]
[41048,"UX","FC Auxiliary Services","FC","AUX",41048,"3092UX",309000,300001,null,null,null,null,null,377000,"CC Physical Plant",200004,"Chukchi Campus Allocation"]
[41049,"UX","FC Auxiliary Services","FC","AUX",41049,"3092UX",309000,300001,null,null,null,null,null,378000,"CC Scholarships",200004,"Chukchi Campus Allocation"]
[41050,"UX","FC Auxiliary Services","FC","AUX",41050,"3092UX",309000,300001,null,null,null,null,null,379000,"CC Auxiliary Services",200004,"Chukchi Campus Allocation"]
[41051,"UX","FC Auxiliary Services","FC","AUX",41051,"3092UX",309000,300001,null,null,null,null,null,"380X00","FOR Unallocated Authority",300002,"UAF Organized Research Allocation"]
[41052,"UX","FC Auxiliary Services","FC","AUX",41052,"3092UX",309000,300001,null,null,null,null,null,381000,"FOR Instruction",300002,"UAF Organized Research Allocation"]
[41053,"UX","FC Auxiliary Services","FC","AUX",41053,"3092UX",309000,300001,null,null,null,null,null,382000,"FOR Research",300002,"UAF Organized Research Allocation"]
[41054,"UX","FC Auxiliary Services","FC","AUX",41054,"3092UX",309000,300001,null,null,null,null,null,383000,"FOR Public Service",300002,"UAF Organized Research Allocation"]
[41055,"UX","FC Auxiliary Services","FC","AUX",41055,"3092UX",309000,300001,null,null,null,null,null,386000,"FOR Institutional Supt",300002,"UAF Organized Research Allocation"]
[41056,"UX","FC Auxiliary Services","FC","AUX",41056,"3092UX",309000,300001,null,null,null,null,null,388000,"FOR Financial Aid/Schol",300002,"UAF Organized Research Allocation"]
[41057,"UX","FC Auxiliary Services","FC","AUX",41057,"3092UX",309000,300001]
[41058,"UX","FC Auxiliary Services","FC","AUX",41058,"3092UX",309000,300001]
[41059,"UX","FC Auxiliary Services","FC","AUX",41059,"3092UX",309000,300001]
[41060,"UX","FC Auxiliary Services","FC","AUX",41060,"3092UX",309000,300001]
[41061,"UX","FC Auxiliary Services","FC","AUX",41061,"3092UX",309000,300001]
[41062,"UX","FC Auxiliary Services","FC","AUX",41062,"3092UX",309000,300001]
[41063,"UX","FC Auxiliary Services","FC","AUX",41063,"3092UX",309000,300001]
[41064,"UX","FC Auxiliary Services","FC","AUX",41064,"3092UX",309000,300001]
[41065,"UX","FC Auxiliary Services","FC","AUX",41065,"3092UX",309000,300001]
[41066,"UX","FC Auxiliary Services","FC","AUX",41066,"3092UX",309000,300001]
[41067,"UX","FC Auxiliary Services","FC","AUX",41067,"3092UX",309000,300001]
[41068,"UX","FC Auxiliary Services","FC","AUX",41068,"3092UX",309000,300001]
[41069,"FA","FC Scholarships","FC","FA",41069,"308AFA",308000,300001]
[41070,"UX","FC Auxiliary Services","FC","AUX",41070,"3092UX",309000,300001]
[41071,"UX","FC Auxiliary Services","FC","AUX",41071,"3092UX",309000,300001]
[41072,"UX","FC Auxiliary Services","FC","AUX",41072,"3092UX",309000,300001]
[41073,"UX","FC Auxiliary Services","FC","AUX",41073,"3092UX",309000,300001]
[41074,"UX","FC Auxiliary Services","FC","AUX",41074,"3092UX",309000,300001]
[41075,"UX","FC Auxiliary Services","FC","AUX",41075,"3092UX",309000,300001]
[{"$f":"IF(F116>0,VALUE(F116),\" \")","v":41076},{"$f":"IF(A116<>\" \",RIGHT(G116,2),\" \")","v":"UX"},{"$f":"IF(A116<>\" \",VLOOKUP(H116,ALLOC_NCHEMS,2,0),\" \")","v":"FC Auxiliary Services"},{"$f":"IF(A116<>\" \",VLOOKUP(I116,ALLOC,2,0),\" \")","v":"FC"},"AUX",41076,"3091UX",309000,300001]
[41077,"UX","FC Auxiliary Services","FC","AUX",41077,"3091UX",309000,300001]
[41078,"UX","FC Auxiliary Services","FC","AUX",41078,"3093UX",309000,300001]
[41079,"UX","FC Auxiliary Services","FC","AUX",41079,"3093UX",309000,300001]
[41080,"UX","FC Auxiliary Services","FC","AUX",41080,"3093UX",309000,300001]
[41081,"UX","FC Auxiliary Services","FC","AUX",41081,"3093UX",309000,300001]
[41082,"UX","FC Auxiliary Services","FC","AUX",41082,"3093UX",309000,300001]
[41083,"UX","FC Auxiliary Services","FC","AUX",41083,"3093UX",309000,300001]
[41084,"UX","FC Auxiliary Services","FC","AUX",41084,"3093UX",309000,300001]
[41085,"SZ","FC Student Services","FC","SS",41085,"3050SZ",305000,300001]
[41086,"UX","FC Auxiliary Services","FC","AUX",41086,"3093UX",309000,300001]
[41087,"UX","FC Auxiliary Services","FC","AUX",41087,"3093UX",309000,300001]
[41088,"SS","FC Student Services","FC","SS",41088,"3053SS",305000,300001]
[41089,"SS","FC Student Services","FC","SS",41089,"3053SS",305000,300001]
[41090,"SS","FC Student Services","FC","SS",41090,"3053SS",305000,300001]
[41091,"SS","FC Student Services","FC",{"$f":"IF(A131<>\" \",VLOOKUP(B131,NCHEMS_ABBR,3,0),\" \")","v":"SS"},41091,"3053SS",305000,300001]
[41092,"SS","FC Student Services","FC","SS",41092,"3050SS",305000,300001]
[41093,"SS","FC Student Services","FC","SS",41093,"3050SS",305000,300001]
[41094,"SS","FC Student Services","FC","SS",41094,"3050SS",305000,300001]
[41095,"SS","FC Student Services","FC","SS",41095,"3050SS",305000,300001]
[41096,"SS","FC Student Services","FC","SS",41096,"3050SS",305000,300001]
[41097,"SS","FC Student Services","FC","SS",41097,"3050SS",305000,300001]
[41098,"SS","FC Student Services","FC","SS",41098,"3050SS",305000,300001]
[41099,"AS","FC Academic Support","FC","AS",41099,"3045AS",304000,300001]
[41100,"SS","FC Student Services","FC","SS",41100,"3050SS",305000,300001]
[41101,"SS","FC Student Services","FC","SS",41101,"3050SS",305000,300001]
[41102,"SS","FC Student Services","FC","SS",41102,"3050SS",305000,300001]
[41103,"SS","FC Student Services","FC","SS",41103,"3050SS",305000,300001]
[41104,"SS","FC Student Services","FC","SS",41104,"3050SS",305000,300001]
[41105,"SS","FC Student Services","FC","SS",41105,"3050SS",305000,300001]
[41106,"SS","FC Student Services","FC","SS",41106,"3050SS",305000,300001]
[41107,"SS","FC Student Services","FC","SS",41107,"3050SS",305000,300001]
[41108,"SS","FC Student Services","FC","SS",41108,"3050SS",305000,300001]
[41109,"SZ","FC Student Services","FC","SS",41109,"3050SZ",305000,300001]
[41110,"SZ","FC Student Services","FC","SS",41110,"3050SZ",305000,300001]
[41111,"SZ","FC Student Services","FC","SS",41111,"3050SZ",305000,300001]
[41112,"SZ","FC Student Services","FC","SS",41112,"3050SZ",305000,300001]
[41113,"SZ","FC Student Services","FC","SS",41113,"3050SZ",305000,300001]
[41114,"SZ","FC Student Services","FC","SS",41114,"3050SZ",305000,300001]
[41115,"SZ","FC Student Services","FC","SS",41115,"3050SZ",305000,300001]
[41116,"SZ","FC Student Services","FC","SS",41116,"3050SZ",305000,300001]
[41117,"FA","FC Scholarships","FC","FA",41117,"3080FA",308000,300001]
[41118,"FA","FC Scholarships","FC","FA",41118,"3080FA",308000,300001]
[41119,"SS","FC Student Services","FC","SS",41119,"3062SS",305000,300001]
[41120,"SZ","FC Student Services","FC","SS",41120,"3050SZ",305000,300001]
[41121,"SZ","FC Student Services","FC","SS",41121,"3050SZ",305000,300001]
[41122,"SZ","FC Student Services","FC","SS",41122,"3050SZ",305000,300001]
[41123,"SZ","FC Student Services","FC","SS",41123,"3050SZ",305000,300001]
[41124,"SZ","FC Student Services","FC","SS",41124,"3050SZ",305000,300001]
[41125,"UX","FC Auxiliary Services","FC","AUX",41125,"3092UX",309000,300001]
[41126,"SZ","FC Student Services","FC","SS",41126,"3050SZ",305000,300001]
[41127,"SZ","FC Student Services","FC","SS",41127,"3050SZ",305000,300001]
[41128,"SZ","FC Student Services","FC","SS",41128,"3050SZ",305000,300001]
[41129,"SZ","FC Student Services","FC","SS",41129,"3050SZ",305000,300001]
[41130,"GZ","FC Institutional Support","FC","IS",41130,"3050GZ",306000,300001]
[41131,"SZ","FC Student Services","FC","SS",41131,"3050SZ",305000,300001]
[41132,"SZ","FC Student Services","FC","SS",41132,"3050SZ",305000,300001]
[41133,"SZ","FC Student Services","FC","SS",41133,"3050SZ",305000,300001]
[41134,"SZ","FC Student Services","FC","SS",41134,"3050SZ",305000,300001]
[41135,"GZ","FC Institutional Support","FC","IS",41135,"3050GZ",306000,300001]
[41136,"SZ","FC Student Services","FC","SS",41136,"3050SZ",305000,300001]
[41137,"SZ","FC Student Services","FC","SS",41137,"3050SZ",305000,300001]
[41138,"SZ","FC Student Services","FC","SS",41138,"3050SZ",305000,300001]
[41139,"SZ","FC Student Services","FC","SS",41139,"3050SZ",305000,300001]
[{"$f":"IF(F180>0,VALUE(F180),\" \")","v":41140},{"$f":"IF(A180<>\" \",RIGHT(G180,2),\" \")","v":"SZ"},{"$f":"IF(A180<>\" \",VLOOKUP(H180,ALLOC_NCHEMS,2,0),\" \")","v":"FC Student Services"},{"$f":"IF(A180<>\" \",VLOOKUP(I180,ALLOC,2,0),\" \")","v":"FC"},"SS",41140,"3050SZ",305000,300001]
[41141,"SZ","FC Student Services","FC","SS",41141,"3050SZ",305000,300001]
[41142,"SZ","FC Student Services","FC","SS",41142,"3050SZ",305000,300001]
[41143,"SY","FC Student Services","FC","SS",41143,"3050SY",305000,300001]
[41144,"SS","FC Student Services","FC","SS",41144,"3062SS",305000,300001]
[41145,"SS","FC Student Services","FC","SS",41145,"3062SS",305000,300001]
[41146,"SS","FC Student Services","FC","SS",41146,"3062SS",305000,300001]
[41147,"SZ","FC Student Services","FC","SS",41147,"3050SZ",305000,300001]
[41148,"SZ","FC Student Services","FC","SS",41148,"3050SZ",305000,300001]
[41149,"SZ","FC Student Services","FC","SS",41149,"3050SZ",305000,300001]
[41150,"SZ","FC Student Services","FC","SS",41150,"3050SZ",305000,300001]
[41151,"SZ","FC Student Services","FC","SS",41151,"3050SZ",305000,300001]
[41152,"SZ","FC Student Services","FC","SS",41152,"3050SZ",305000,300001]
[41153,"SZ","FC Student Services","FC","SS",41153,"3050SZ",305000,300001]
[41154,"SZ","FC Student Services","FC","SS",41154,"3050SZ",305000,300001]
[41155,"SZ","FC Student Services","FC",{"$f":"IF(A195<>\" \",VLOOKUP(B195,NCHEMS_ABBR,3,0),\" \")","v":"SS"},41155,"3050SZ",305000,300001]
[41156,"SZ","FC Student Services","FC","SS",41156,"3050SZ",305000,300001]
[41157,"SZ","FC Student Services","FC","SS",41157,"3050SZ",305000,300001]
[41158,"SZ","FC Student Services","FC","SS",41158,"3050SZ",305000,300001]
[41159,"SZ","FC Student Services","FC","SS",41159,"3050SZ",305000,300001]
[41160,"SZ","FC Student Services","FC","SS",41160,"3050SZ",305000,300001]
[41161,"SS","FC Student Services","FC","SS",41161,"3051SS",305000,300001]
[41162,"SZ","FC Student Services","FC","SS",41162,"3051SZ",305000,300001]
[41163,"SZ","FC Student Services","FC","SS",41163,"3050SZ",305000,300001]
[41164,"SZ","FC Student Services","FC","SS",41164,"3050SZ",305000,300001]
[41165,"SZ","FC Student Services","FC","SS",41165,"3050SZ",305000,300001]
[41166,"SZ","FC Student Services","FC","SS",41166,"3050SZ",305000,300001]
[41167,"SZ","FC Student Services","FC","SS",41167,"3050SZ",305000,300001]
[41168,"SZ","FC Student Services","FC","SS",41168,"3050SZ",305000,300001]
[41169,"SZ","FC Student Services","FC","SS",41169,"3050SZ",305000,300001]
[41170,"SZ","FC Student Services","FC","SS",41170,"3050SZ",305000,300001]
[41171,"SZ","FC Student Services","FC","SS",41171,"3050SZ",305000,300001]
[41172,"SZ","FC Student Services","FC","SS",41172,"3050SZ",305000,300001]
[41173,"SZ","FC Student Services","FC","SS",41173,"3050SZ",305000,300001]
[41174,"SZ","FC Student Services","FC","SS",41174,"3050SZ",305000,300001]
[41175,"SZ","FC Student Services","FC","SS",41175,"3050SZ",305000,300001]
[41176,"SZ","FC Student Services","FC","SS",41176,"3051SZ",305000,300001]
[41177,"SZ","FC Student Services","FC","SS",41177,"3051SZ",305000,300001]
[41178,"SZ","FC Student Services","FC","SS",41178,"3051SZ",305000,300001]
[41179,"SZ","FC Student Services","FC","SS",41179,"3051SZ",305000,300001]
[41180,"SZ","FC Student Services","FC","SS",41180,"3051SZ",305000,300001]
[41181,"SZ","FC Student Services","FC","SS",41181,"3050SZ",305000,300001]
[41182,"SZ","FC Student Services","FC","SS",41182,"3050SZ",305000,300001]
[41183,"SZ","FC Student Services","FC","SS",41183,"3050SZ",305000,300001]
[41184,"SZ","FC Student Services","FC","SS",41184,"3050SZ",305000,300001]
[41185,"SZ","FC Student Services","FC","SS",41185,"3050SZ",305000,300001]
[41186,"SZ","FC Student Services","FC","SS",41186,"3050SZ",305000,300001]
[41187,"SZ","FC Student Services","FC","SS",41187,"3050SZ",305000,300001]
[41188,"SZ","FC Student Services","FC","SS",41188,"3050SZ",305000,300001]
[41189,"SZ","FC Student Services","FC","SS",41189,"3050SZ",305000,300001]
[41190,"SZ","FC Student Services","FC","SS",41190,"3050SZ",305000,300001]
[41191,"SZ","FC Student Services","FC","SS",41191,"3050SZ",305000,300001]
[41192,"SZ","FC Student Services","FC","SS",41192,"3050SZ",305000,300001]
[41193,"SZ","FC Student Services","FC","SS",41193,"3050SZ",305000,300001]
[41194,"SZ","FC Student Services","FC","SS",41194,"3050SZ",305000,300001]
[41195,"SZ","FC Student Services","FC","SS",41195,"3050SZ",305000,300001]
[41196,"SZ","FC Student Services","FC","SS",41196,"3050SZ",305000,300001]
[41197,"SZ","FC Student Services","FC","SS",41197,"3050SZ",305000,300001]
[41198,"SZ","FC Student Services","FC","SS",41198,"3050SZ",305000,300001]
[41199,"SZ","FC Student Services","FC","SS",41199,"3050SZ",305000,300001]
[41200,"SA","FC Intercollegiate Athl","FC","A",41200,"3054SA",305500,300001]
[41201,"SA","FC Intercollegiate Athl","FC","A",41201,"3054SA",305500,300001]
[41202,"SA","FC Intercollegiate Athl","FC","A",41202,"3054SA",305500,300001]
[41203,"SA","FC Intercollegiate Athl","FC","A",41203,"3054SA",305500,300001]
[{"$f":"IF(F244>0,VALUE(F244),\" \")","v":41204},{"$f":"IF(A244<>\" \",RIGHT(G244,2),\" \")","v":"SA"},{"$f":"IF(A244<>\" \",VLOOKUP(H244,ALLOC_NCHEMS,2,0),\" \")","v":"FC Intercollegiate Athl"},{"$f":"IF(A244<>\" \",VLOOKUP(I244,ALLOC,2,0),\" \")","v":"FC"},"A",41204,"3054SA",305500,300001]
[41205,"SA","FC Intercollegiate Athl","FC","A",41205,"3054SA",305500,300001]
[41206,"SA","FC Intercollegiate Athl","FC","A",41206,"3054SA",305500,300001]
[41207,"SA","FC Intercollegiate Athl","FC","A",41207,"3054SA",305500,300001]
[41208,"SA","FC Intercollegiate Athl","FC","A",41208,"3054SA",305500,300001]
[41209,"SA","FC Intercollegiate Athl","FC","A",41209,"3054SA",305500,300001]
[41210,"SA","FC Intercollegiate Athl","FC","A",41210,"3054SA",305500,300001]
[41211,"SA","FC Intercollegiate Athl","FC","A",41211,"3054SA",305500,300001]
[41212,"SA","FC Intercollegiate Athl","FC","A",41212,"3054SA",305500,300001]
[41213,"SA","FC Intercollegiate Athl","FC","A",41213,"3054SA",305500,300001]
[41214,"SA","FC Intercollegiate Athl","FC","A",41214,"3054SA",305500,300001]
[41215,"SA","FC Intercollegiate Athl","FC","A",41215,"3054SA",305500,300001]
[41216,"SA","FC Intercollegiate Athl","FC","A",41216,"3054SA",305500,300001]
[41217,"SA","FC Intercollegiate Athl","FC","A",41217,"3054SA",305500,300001]
[41218,"SA","FC Intercollegiate Athl","FC","A",41218,"3054SA",305500,300001]
[41219,"SA","FC Intercollegiate Athl","FC",{"$f":"IF(A259<>\" \",VLOOKUP(B259,NCHEMS_ABBR,3,0),\" \")","v":"A"},41219,"3054SA",305500,300001]
[41220,"SA","FC Intercollegiate Athl","FC","A",41220,"3054SA",305500,300001]
[41221,"SA","FC Intercollegiate Athl","FC","A",41221,"3054SA",305500,300001]
[41222,"SA","FC Intercollegiate Athl","FC","A",41222,"3054SA",305500,300001]
[41223,"SA","FC Intercollegiate Athl","FC","A",41223,"3054SA",305500,300001]
[41224,"SA","FC Intercollegiate Athl","FC","A",41224,"3054SA",305500,300001]
[41225,"SA","FC Intercollegiate Athl","FC","A",41225,"3054SA",305500,300001]
[41226,"SA","FC Intercollegiate Athl","FC","A",41226,"3054SA",305500,300001]
[41239,"SZ","FC Student Services","FC","SS",41239,"3050SZ",305000,300001]
[41240,"SZ","FC Student Services","FC","SS",41240,"3050SZ",305000,300001]
[41241,"SZ","FC Student Services","FC","SS",41241,"3050SZ",305000,300001]
[41242,"SZ","FC Student Services","FC","SS",41242,"3050SZ",305000,300001]
[41243,"SZ","FC Student Services","FC","SS",41243,"3050SZ",305000,300001]
[41244,"SZ","FC Student Services","FC","SS",41244,"3050SZ",305000,300001]
[41245,"SZ","FC Student Services","FC","SS",41245,"3050SZ",305000,300001]
[41246,"SZ","FC Student Services","FC","SS",41246,"3050SZ",305000,300001]
[41247,"SZ","FC Student Services","FC","SS",41247,"3050SZ",305000,300001]
[41248,"SZ","FC Student Services","FC","SS",41248,"3050SZ",305000,300001]
[41249,"SZ","FC Student Services","FC","SS",41249,"3050SZ",305000,300001]
[41250,"SZ","FC Student Services","FC","SS",41250,"3051SZ",305000,300001]
[41251,"SZ","FC Student Services","FC","SS",41251,"3051SZ",305000,300001]
[41252,"SZ","FC Student Services","FC","SS",41252,"3051SZ",305000,300001]
[41253,"SZ","FC Student Services","FC","SS",41253,"3051SZ",305000,300001]
[41254,"SZ","FC Student Services","FC","SS",41254,"3051SZ",305000,300001]
[41255,"SZ","FC Student Services","FC","SS",41255,"3051SZ",305000,300001]
[41259,"OM","FC Physical Plant","FC","PP",41259,"3077OM",307000,300001]
[41260,"SS","FC Student Services","FC","SS",41260,"3053SS",305000,300001]
[41261,"SS","FC Student Services","FC","SS",41261,"3062SS",305000,300001]
[41262,"SS","FC Student Services","FC","SS",41262,"3050SS",305000,300001]
[41263,"FA","FC Scholarships","FC","FA",41263,"3080FA",308000,300001]
[41264,"ID","FC Instruction","FC","I",41264,"3080ID",301000,300001]
[41265,"SS","FC Student Services","FC","SS",41265,"3053SS",305000,300001]
[41266,"SS","FC Student Services","FC","SS",41266,"3050SS",305000,300001]
[41267,"AC","FC Academic Support","FC","AS",41267,"304EAC",304000,300001]
[41268,"IN","FC Instruction","FC","I",41268,"3017IN",301000,300001]
[41269,"SS","FC Student Services","FC","SS",41269,"3062SS",305000,300001]
[41270,"AC","FC Academic Support","FC","AS",41270,"304EAC",304000,300001]
[41271,"SS","FC Student Services","FC","SS",41271,"3062SS",305000,300001]
[41275,"SS","FC Student Services","FC","SS",41275,"3062SS",305000,300001]
[41276,"FA","FC Scholarships","FC","FA",41276,"3087FA",308000,300001]
[41277,"SS","FC Student Services","FC","SS",41277,"3062SS",305000,300001]
[41278,"PS","FC Public Service","FC","PS",41278,"3050PS",303000,300001]
[41279,"SZ","FC Student Services","FC","SS",41279,"3050SZ",305000,300001]
[41280,"SS","FC Student Services","FC","SS",41280,"3050SS",305000,300001]
[41281,"SZ","FC Student Services","FC","SS",41281,"3050SZ",305000,300001]
[41282,"FA","FC Scholarships","FC","FA",41282,"308AFA",308000,300001]
[41283,"SS","FC Student Services","FC","SS",41283,"3053SS",305000,300001]
[41284,"SS","FC Student Services","FC","SS",41284,"3050SS",305000,300001]
[41285,"SS","FC Student Services","FC","SS",41285,"3050SS",305000,300001]
[{"$f":"IF(F308>0,VALUE(F308),\" \")","v":41286},{"$f":"IF(A308<>\" \",RIGHT(G308,2),\" \")","v":"SZ"},{"$f":"IF(A308<>\" \",VLOOKUP(H308,ALLOC_NCHEMS,2,0),\" \")","v":"FC Student Services"},{"$f":"IF(A308<>\" \",VLOOKUP(I308,ALLOC,2,0),\" \")","v":"FC"},"SS",41286,"3050SZ",305000,300001]
[41287,"PS","FC Public Service","FC","PS",41287,"3050PS",303000,300001]
[41288,"PS","FC Public Service","FC","PS",41288,"3050PS",303000,300001]
[41289,"SZ","FC Student Services","FC","SS",41289,"3050SZ",305000,300001]
[41290,"PS","FC Public Service","FC","PS",41290,"3050PS",303000,300001]
[41291,"PS","FC Public Service","FC","PS",41291,"3050PS",303000,300001]
[41297,"IN","FC Instruction","FC","I",41297,"3014IN",301000,300001]
[41298,"IN","FC Instruction","FC","I",41298,"3014IN",301000,300001]
[41299,"PS","FC Public Service","FC","PS",41299,"3045PS",303000,300001]
[41300,"SZ","FC Student Services","FC","SS",41300,"3056SZ",305000,300001]
[41301,"SS","FC Student Services","FC","SS",41301,"3056SS",305000,300001]
[41302,"SZ","FC Student Services","FC","SS",41302,"3056SZ",305000,300001]
[41303,"SZ","FC Student Services","FC","SS",41303,"3056SZ",305000,300001]
[41304,"SZ","FC Student Services","FC","SS",41304,"3056SZ",305000,300001]
[41305,"SZ","FC Student Services","FC","SS",41305,"3056SZ",305000,300001]
[41306,"SZ","FC Student Services","FC",{"$f":"IF(A323<>\" \",VLOOKUP(B323,NCHEMS_ABBR,3,0),\" \")","v":"SS"},41306,"3056SZ",305000,300001]
[41307,"SZ","FC Student Services","FC","SS",41307,"3056SZ",305000,300001]
[41308,"SZ","FC Student Services","FC","SS",41308,"3056SZ",305000,300001]
[41309,"SZ","FC Student Services","FC","SS",41309,"3056SZ",305000,300001]
[41310,"SZ","FC Student Services","FC","SS",41310,"3056SZ",305000,300001]
[41311,"SZ","FC Student Services","FC","SS",41311,"3056SZ",305000,300001]
[41312,"SZ","FC Student Services","FC","SS",41312,"3056SZ",305000,300001]
[41313,"SZ","FC Student Services","FC","SS",41313,"3056SZ",305000,300001]
[41314,"SZ","FC Student Services","FC","SS",41314,"3056SZ",305000,300001]
[41315,"SZ","FC Student Services","FC","SS",41315,"3056SZ",305000,300001]
[41316,"SZ","FC Student Services","FC","SS",41316,"3056SZ",305000,300001]
[41317,"SZ","FC Student Services","FC","SS",41317,"3056SZ",305000,300001]
[41318,"SZ","FC Student Services","FC","SS",41318,"3056SZ",305000,300001]
[41319,"SZ","FC Student Services","FC","SS",41319,"3056SZ",305000,300001]
[41320,"SZ","FC Student Services","FC","SS",41320,"3056SZ",305000,300001]
[41321,"FA","FC Scholarships","FC","FA",41321,"308AFA",308000,300001]
[41322,"FA","FC Scholarships","FC","FA",41322,"308AFA",308000,300001]
[41323,"UX","FC Auxiliary Services","FC","AUX",41323,"3092UX",309000,300001]
[41324,"SZ","FC Student Services","FC","SS",41324,"3056SZ",305000,300001]
[41325,"UM","FC Auxiliary Services","FC","AUX",41325,"3090UM",309000,300001]
[41326,"UM","FC Auxiliary Services","FC","AUX",41326,"3090UM",309000,300001]
[41327,"UM","FC Auxiliary Services","FC","AUX",41327,"3090UM",309000,300001]
[41328,"UM","FC Auxiliary Services","FC","AUX",41328,"3090UM",309000,300001]
[41329,"UM","FC Auxiliary Services","FC","AUX",41329,"3090UM",309000,300001]
[41330,"UM","FC Auxiliary Services","FC","AUX",41330,"3090UM",309000,300001]
[41331,"UM","FC Auxiliary Services","FC","AUX",41331,"3090UM",309000,300001]
[41332,"UM","FC Auxiliary Services","FC","AUX",41332,"3090UM",309000,300001]
[41333,"UM","FC Auxiliary Services","FC","AUX",41333,"3090UM",309000,300001]
[41334,"UM","FC Auxiliary Services","FC","AUX",41334,"3090UM",309000,300001]
[41335,"UM","FC Auxiliary Services","FC","AUX",41335,"3090UM",309000,300001]
[41336,"UM","FC Auxiliary Services","FC","AUX",41336,"3090UM",309000,300001]
[41337,"UM","FC Auxiliary Services","FC","AUX",41337,"3090UM",309000,300001]
[41338,"UM","FC Auxiliary Services","FC","AUX",41338,"3090UM",309000,300001]
[41339,"UM","FC Auxiliary Services","FC","AUX",41339,"3090UM",309000,300001]
[41340,"UM","FC Auxiliary Services","FC","AUX",41340,"3090UM",309000,300001]
[41341,"UM","FC Auxiliary Services","FC","AUX",41341,"3090UM",309000,300001]
[41342,"UM","FC Auxiliary Services","FC","AUX",41342,"3090UM",309000,300001]
[41343,"UM","FC Auxiliary Services","FC","AUX",41343,"3090UM",309000,300001]
[41344,"UX","FC Auxiliary Services","FC","AUX",41344,"3092UX",309000,300001]
[41345,"SZ","FC Student Services","FC","SS",41345,"3056SZ",305000,300001]
[41346,"UX","FC Auxiliary Services","FC","AUX",41346,"3092UX",309000,300001]
[41347,"UX","FC Auxiliary Services","FC","AUX",41347,"3092UX",309000,300001]
[41348,"UM","FC Auxiliary Services","FC","AUX",41348,"3090UM",309000,300001]
[41349,"SZ","FC Student Services","FC","SS",41349,"3056SZ",305000,300001]
[41350,"SZ","FC Student Services","FC","SS",41350,"3056SZ",305000,300001]
[41351,"OM","FC Physical Plant","FC","PP",41351,"3077OM",307000,300001]
[41352,"UM","FC Auxiliary Services","FC","AUX",41352,"3090UM",309000,300001]
[41479,"SZ","FC Student Services","FC","SS",41479,"3050SZ",305000,300001]
[41480,"SZ","FC Student Services","FC","SS",41480,"3050SZ",305000,300001]
[{"$f":"IF(F372>0,VALUE(F372),\" \")","v":41481},{"$f":"IF(A372<>\" \",RIGHT(G372,2),\" \")","v":"SZ"},{"$f":"IF(A372<>\" \",VLOOKUP(H372,ALLOC_NCHEMS,2,0),\" \")","v":"FC Student Services"},{"$f":"IF(A372<>\" \",VLOOKUP(I372,ALLOC,2,0),\" \")","v":"FC"},"SS",41481,"3050SZ",305000,300001]
[41482,"SZ","FC Student Services","FC","SS",41482,"3050SZ",305000,300001]
[41484,"SZ","FC Student Services","FC","SS",41484,"3050SZ",305000,300001]
[41485,"SZ","FC Student Services","FC","SS",41485,"3050SZ",305000,300001]
[41487,"SZ","FC Student Services","FC","SS",41487,"3050SZ",305000,300001]
[42000,"UX","BBC Auxiliary Services","BBC","AUX",42000,"2190UX",219000,200003]
[42001,"IN","RC Instruction","RC","I",42001,"3215IN",321000,300006]
[42002,"IN","BBC Instruction","BBC","I",42002,"2110IN",211000,200003]
[42003,"IN","BBC Instruction","BBC","I",42003,"2110IN",211000,200003]
[42004,"ID","BBC Instruction","BBC","I",42004,"2110ID",211000,200003]
[42005,"IN","BBC Instruction","BBC","I",42005,"2110IN",211000,200003]
[42006,"IN","BBC Instruction","BBC","I",42006,"2110IN",211000,200003]
[42007,"IN","BBC Instruction","BBC","I",42007,"2112IN",211000,200003]
[42008,"IN","BBC Instruction","BBC","I",42008,"2110IN",211000,200003]
[42009,"OM","BBC Physical Plant","BBC","PP",42009,"2170OM",217000,200003]
[42010,"OM","BBC Physical Plant","BBC",{"$f":"IF(A387<>\" \",VLOOKUP(B387,NCHEMS_ABBR,3,0),\" \")","v":"PP"},42010,"2171OM",217000,200003]
[42011,"AS","BBC Academic Support","BBC","AS",42011,"2110AS",214000,200003]
[42012,"ID","BBC Instruction","BBC","I",42012,"2110ID",211000,200003]
[42013,"AS","BBC Academic Support","BBC","AS",42013,"2110AS",214000,200003]
[42014,"AS","BBC Academic Support","BBC","AS",42014,"2110AS",214000,200003]
[42015,"SS","BBC Student Services","BBC","SS",42015,"2110SS",215000,200003]
[42016,"FA","BBC Scholarships","BBC","FA",42016,"2180FA",218000,200003]
[42017,"PS","BBC Public Service","BBC","PS",42017,"2130PS",213000,200003]
[42018,"OM","BBC Physical Plant","BBC","PP",42018,"2171OM",217000,200003]
[42019,"IN","BBC Instruction","BBC","I",42019,"2110IN",211000,200003]
[42020,"ID","BBC Instruction","BBC","I",42020,"2110ID",211000,200003]
[42021,"ID","BBC Instruction","BBC","I",42021,"2110ID",211000,200003]
[42022,"ID","BBC Instruction","BBC","I",42022,"2110ID",211000,200003]
[42023,"ID","BBC Instruction","BBC","I",42023,"2110ID",211000,200003]
[42024,"ID","BBC Instruction","BBC","I",42024,"2110ID",211000,200003]
[42025,"IN","BBC Instruction","BBC","I",42025,"2110IN",211000,200003]
[42026,"FA","BBC Scholarships","BBC","FA",42026,"2180FA",218000,200003]
[42027,"IN","BBC Instruction","BBC","I",42027,"2110IN",211000,200003]
[42028,"OM","RC Physical Plant","RC","PP",42028,"3272OM",327000,300006]
[42029,"SS","BBC Student Services","BBC","SS",42029,"2110SS",215000,200003]
[42030,"ID","BBC Instruction","BBC","I",42030,"2110ID",211000,200003]
[42031,"ID","BBC Instruction","BBC","I",42031,"2110ID",211000,200003]
[42032,"ID","BBC Instruction","BBC","I",42032,"2110ID",211000,200003]
[42033,"ID","BBC Instruction","BBC","I",42033,"2110ID",211000,200003]
[42034,"IN","BBC Instruction","BBC","I",42034,"2110IN",211000,200003]
[42035,"IN","BBC Instruction","BBC","I",42035,"2110IN",211000,200003]
[42036,"ID","BBC Instruction","BBC","I",42036,"2110ID",211000,200003]
[42037,"ID","BBC Instruction","BBC","I",42037,"2110ID",211000,200003]
[42038,"ID","BBC Instruction","BBC","I",42038,"2110ID",211000,200003]
[42039,"ID","BBC Instruction","BBC","I",42039,"2110ID",211000,200003]
[42040,"ID","BBC Instruction","BBC","I",42040,"2110ID",211000,200003]
[42041,"ID","BBC Instruction","BBC","I",42041,"2110ID",211000,200003]
[42042,"ID","BBC Instruction","BBC","I",42042,"2110ID",211000,200003]
[42043,"ID","BBC Instruction","BBC","I",42043,"2110ID",211000,200003]
[42044,"PM","BBC Public Service","BBC","PS",42044,"2130PM",213000,200003]
[42045,"IN","BBC Instruction","BBC","I",42045,"2110IN",211000,200003]
[42046,"FA","BBC Scholarships","BBC","FA",42046,"2180FA",218000,200003]
[42998,"IN","BBC Instruction","BBC","I",42998,"2110IN",211000,200003]
[43000,"UX","CC Auxiliary Services","CC","AUX",43000,"3790UX",379000,200004]
[43001,"IN","CC Instruction","CC","I",43001,"3711IN",371000,200004]
[43002,"IN","CC Instruction","CC","I",43002,"3711IN",371000,200004]
[43003,"IN","CC Instruction","CC","I",43003,"3711IN",371000,200004]
[43004,"IN","CC Instruction","CC","I",43004,"3711IN",371000,200004]
[43005,"ID","CC Instruction","CC","I",43005,"3711ID",371000,200004]
[43006,"IN","CC Instruction","CC","I",43006,"3712IN",371000,200004]
[43007,"OM","CC Physical Plant","CC","PP",43007,"3770OM",377000,200004]
[43008,"OM","CC Physical Plant","CC","PP",43008,"3771OM",377000,200004]
[43009,"IN","CC Instruction","CC","I",43009,"3711IN",371000,200004]
[43010,"AS","CC Academic Support","CC","AS",43010,"3740AS",374000,200004]
[{"$f":"IF(F436>0,VALUE(F436),\" \")","v":43011},{"$f":"IF(A436<>\" \",RIGHT(G436,2),\" \")","v":"AS"},{"$f":"IF(A436<>\" \",VLOOKUP(H436,ALLOC_NCHEMS,2,0),\" \")","v":"CC Academic Support"},{"$f":"IF(A436<>\" \",VLOOKUP(I436,ALLOC,2,0),\" \")","v":"CC"},"AS",43011,"3740AS",374000,200004]
[43012,"ID","CC Instruction","CC","I",43012,"3711ID",371000,200004]
[43013,"AL","CC Library Services","CC","L",43013,"3742AL",374500,200004]
[43014,"SS","CC Student Services","CC","SS",43014,"3750SS",375000,200004]
[43015,"ID","CC Instruction","CC","I",43015,"3711ID",371000,200004]
[43016,"ID","CC Instruction","CC","I",43016,"3711ID",371000,200004]
[43017,"ID","CC Instruction","CC","I",43017,"3711ID",371000,200004]
[43018,"ID","CC Instruction","CC","I",43018,"3711ID",371000,200004]
[43019,"ID","CC Instruction","CC","I",43019,"3711ID",371000,200004]
[43020,"ID","CC Instruction","CC","I",43020,"3711ID",371000,200004]
[43021,"ID","CC Instruction","CC","I",43021,"3711ID",371000,200004]
[43022,"FA","CC Scholarships","CC","FA",43022,"3780FA",378000,200004]
[43023,"IN","CC Instruction","CC","I",43023,"3711IN",371000,200004]
[43024,"OM","RC Physical Plant","RC","PP",43024,"3272OM",327000,300006]
[43025,"SS","CC Student Services","CC","SS",43025,"3750SS",375000,200004]
[43026,"AS","CC Academic Support","CC",{"$f":"IF(A451<>\" \",VLOOKUP(B451,NCHEMS_ABBR,3,0),\" \")","v":"AS"},43026,"3740AS",374000,200004]
[43027,"PS","CC Public Service","CC","PS",43027,"3730PS",373000,200004]
[43028,"IN","CC Instruction","CC","I",43028,"3711IN",371000,200004]
[43029,"FA","CC Scholarships","CC","FA",43029,"3780FA",378000,200004]
[43030,"PS","CC Public Service","CC","PS",43030,"3730PS",373000,200004]
[43031,"FA","CC Scholarships","CC","FA",43031,"3780FA",378000,200004]
[43998,"IN","CC Instruction","CC","I",43998,"3711IN",371000,200004]
[44000,"IN","IC Instruction","IC","I",44000,"2210IN",221000,300003]
[44001,"IN","IC Instruction","IC","I",44001,"2210IN",221000,300003]
[44002,"PS","IC Public Service","IC","PS",44002,"2230PS",223000,300003]
[44003,"AS","IC Academic Support","IC","AS",44003,"2210AS",224000,300003]
[44004,"OM","IC Physical Plant","IC","PP",44004,"2271OM",227000,300003]
[44005,"OM","IC Physical Plant","IC","PP",44005,"2271OM",227000,300003]
[44006,"OM","IC Physical Plant","IC","PP",44006,"2270OM",227000,300003]
[44007,"OM","IC Physical Plant","IC","PP",44007,"2270OM",227000,300003]
[44008,"OM","RC Physical Plant","RC","PP",44008,"3272OM",327000,300006]
[44009,"IN","IC Instruction","IC","I",44009,"2210IN",221000,300003]
[44010,"IN","IC Instruction","IC","I",44010,"2210IN",221000,300003]
[44011,"IN","IC Instruction","IC","I",44011,"2210IN",221000,300003]
[44012,"ID","IC Instruction","IC","I",44012,"2210ID",221000,300003]
[44013,"IN","IC Instruction","IC","I",44013,"2210IN",221000,300003]
[44014,"IN","IC Instruction","IC","I",44014,"2210IN",221000,300003]
[44015,"FA","IC Scholarships","IC","FA",44015,"2210FA",228000,300003]
[44016,"ID","IC Instruction","IC","I",44016,"2210ID",221000,300003]
[44017,"SS","IC Student Services","IC","SS",44017,"2210SS",225000,300003]
[44018,"IN","IC Instruction","IC","I",44018,"2210IN",221000,300003]
[44019,"IN","IC Instruction","IC","I",44019,"2210IN",221000,300003]
[44020,"IN","IC Instruction","IC","I",44020,"2210IN",221000,300003]
[44021,"FA","IC Scholarships","IC","FA",44021,"2210FA",228000,300003]
[44022,"FA","IC Scholarships","IC","FA",44022,"2210FA",228000,300003]
[44023,"IN","IC Instruction","IC","I",44023,"2212IN",221000,300003]
[44024,"IN","IC Instruction","IC","I",44024,"2212IN",221000,300003]
[44025,"AS","IC Academic Support","IC","AS",44025,"2210AS",224000,300003]
[44026,"FA","IC Scholarships","IC","FA",44026,"2210FA",228000,300003]
[44027,"IN","IC Instruction","IC","I",44027,"2210IN",221000,300003]
[44028,"SS","IC Student Services","IC","SS",44028,"2210SS",225000,300003]
[44029,"FA","IC Scholarships","IC","FA",44029,"2210FA",228000,300003]
[44030,"IN","IC Instruction","IC","I",44030,"2210IN",221000,300003]
[44031,"IN","IC Instruction","IC","I",44031,"2210IN",221000,300003]
[44032,"ID","IC Instruction","IC","I",44032,"2210ID",221000,300003]
[44033,"IN","IC Instruction","IC","I",44033,"2210IN",221000,300003]
[44034,"IN","IC Instruction","IC","I",44034,"2210IN",221000,300003]
[44035,"ID","IC Instruction","IC","I",44035,"2210ID",221000,300003]
[44036,"ID","IC Instruction","IC","I",44036,"2210ID",221000,300003]
[44037,"IN","IC Instruction","IC","I",44037,"2210IN",221000,300003]
[44038,"IN","IC Instruction","IC","I",44038,"2210IN",221000,300003]
[44039,"ID","IC Instruction","IC","I",44039,"2210ID",221000,300003]
[44040,"IN","IC Instruction","IC","I",44040,"2210IN",221000,300003]
[44041,"ID","IC Instruction","IC","I",44041,"2210ID",221000,300003]
[{"$f":"IF(F500>0,VALUE(F500),\" \")","v":44042},{"$f":"IF(A500<>\" \",RIGHT(G500,2),\" \")","v":"FA"},{"$f":"IF(A500<>\" \",VLOOKUP(H500,ALLOC_NCHEMS,2,0),\" \")","v":"IC Scholarships"},{"$f":"IF(A500<>\" \",VLOOKUP(I500,ALLOC,2,0),\" \")","v":"IC"},"FA",44042,"2210FA",228000,300003]
[44045,"AS","IC Academic Support","IC","AS",44045,"2210AS",224000,300003]
[44050,"AS","IC Academic Support","IC","AS",44050,"2210AS",224000,300003]
[44051,"GS","IC Institutional Support","IC","IS",44051,"2210GS",226000,300003]
[44052,"ID","IC Instruction","IC","I",44052,"2210ID",221000,300003]
[44053,"ID","IC Instruction","IC","I",44053,"2210ID",221000,300003]
[44054,"ID","IC Instruction","IC","I",44054,"2210ID",221000,300003]
[44055,"ID","IC Instruction","IC","I",44055,"2210ID",221000,300003]
[44056,"ID","IC Instruction","IC","I",44056,"2210ID",221000,300003]
[44057,"ID","IC Instruction","IC","I",44057,"2210ID",221000,300003]
[44058,"ID","IC Instruction","IC","I",44058,"2210ID",221000,300003]
[44059,"ID","IC Instruction","IC","I",44059,"2210ID",221000,300003]
[44099,"IN",{"$error":"#N/A"},{"$error":"#N/A"},"I",44099,"0396IN",31000,31100]
[45000,"UX","KC Auxiliary Services","KC","AUX",45000,"3490UX",349000,300004]
[45001,"UX","KC Auxiliary Services","KC","AUX",45001,"3490UX",349000,300004]
[45002,"UX","KC Auxiliary Services","KC",{"$f":"IF(A515<>\" \",VLOOKUP(B515,NCHEMS_ABBR,3,0),\" \")","v":"AUX"},45002,"3490UX",349000,300004]
[45003,"IN","KC Instruction","KC","I",45003,"3411IN",341000,300004]
[45004,"ID","KC Instruction","KC","I",45004,"3410ID",341000,300004]
[45005,"IN","KC Instruction","KC","I",45005,"3411IN",341000,300004]
[45006,"IN","KC Instruction","KC","I",45006,"3410IN",341000,300004]
[45007,"IN","KC Instruction","KC","I",45007,"3411IN",341000,300004]
[45008,"IN","KC Instruction","KC","I",45008,"3411IN",341000,300004]
[45009,"IN","KC Instruction","KC","I",45009,"3411IN",341000,300004]
[45010,"IN","KC Instruction","KC","I",45010,"3411IN",341000,300004]
[45011,"IN","KC Instruction","KC","I",45011,"3411IN",341000,300004]
[45012,"IN","KC Instruction","KC","I",45012,"3411IN",341000,300004]
[45013,"IN","KC Instruction","KC","I",45013,"3410IN",341000,300004]
[45014,"IN","KC Instruction","KC","I",45014,"3411IN",341000,300004]
[45015,"OM","KC Physical Plant","KC","PP",45015,"3470OM",347000,300004]
[45016,"OM","KC Physical Plant","KC","PP",45016,"3471OM",347000,300004]
[45017,"IN","KC Instruction","KC","I",45017,"3411IN",341000,300004]
[45018,"ID","KC Instruction","KC","I",45018,"3410ID",341000,300004]
[45019,"IN","KC Instruction","KC","I",45019,"3411IN",341000,300004]
[45020,"AS","KC Academic Support","KC","AS",45020,"3440AS",344000,300004]
[45021,"AS","KC Academic Support","KC","AS",45021,"3440AS",344000,300004]
[45022,"AS","KC Academic Support","KC","AS",45022,"3440AS",344000,300004]
[45023,"AS","KC Academic Support","KC","AS",45023,"3440AS",344000,300004]
[45024,"ID","KC Instruction","KC","I",45024,"3412ID",341000,300004]
[45025,"AL","KC Library Services","KC","L",45025,"3442AL",344500,300004]
[45026,"ID","KC Instruction","KC","I",45026,"3410ID",341000,300004]
[45027,"SS","KC Student Services","KC","SS",45027,"3450SS",345000,300004]
[45028,"SS","KC Student Services","KC","SS",45028,"3450SS",345000,300004]
[45029,"SZ","KC Student Services","KC","SS",45029,"3450SZ",345000,300004]
[45030,"SZ","KC Student Services","KC","SS",45030,"3450SZ",345000,300004]
[45031,"OM","KC Physical Plant","KC","PP",45031,"3470OM",347000,300004]
[45032,"IN","KC Instruction","KC","I",45032,"3411IN",341000,300004]
[45033,"IN","KC Instruction","KC","I",45033,"3412IN",341000,300004]
[45034,"SZ","KC Student Services","KC","SS",45034,"3450SZ",345000,300004]
[45035,"PS","KC Public Service","KC","PS",45035,"3430PS",343000,300004]
[45036,"SZ","KC Student Services","KC","SS",45036,"3450SZ",345000,300004]
[45037,"FA","KC Scholarships","KC","FA",45037,"3480FA",348000,300004]
[45038,"IN","KC Instruction","KC","I",45038,"3412IN",341000,300004]
[45039,"FA","KC Scholarships","KC","FA",45039,"3480FA",348000,300004]
[45040,"OM","KC Physical Plant","KC","PP",45040,"3471OM",347000,300004]
[45041,"IN","KC Instruction","KC","I",45041,"3411IN",341000,300004]
[45042,"IN","KC Instruction","KC","I",45042,"3411IN",341000,300004]
[45043,"IN","KC Instruction","KC","I",45043,"3411IN",341000,300004]
[45044,"IN","KC Instruction","KC","I",45044,"3411IN",341000,300004]
[45045,"IN","KC Instruction","KC","I",45045,"3411IN",341000,300004]
[45046,"IN","KC Instruction","KC","I",45046,"3411IN",341000,300004]
[45047,"OM","RC Physical Plant","RC","PP",45047,"3272OM",327000,300006]
[45048,"IN","KC Instruction","KC","I",45048,"3411IN",341000,300004]
[45049,"UM","KC Auxiliary Services","KC","AUX",45049,"3470UM",349000,300004]
[45050,"UM","KC Auxiliary Services","KC","AUX",45050,"3470UM",349000,300004]
[{"$f":"IF(F564>0,VALUE(F564),\" \")","v":45051},{"$f":"IF(A564<>\" \",RIGHT(G564,2),\" \")","v":"IN"},{"$f":"IF(A564<>\" \",VLOOKUP(H564,ALLOC_NCHEMS,2,0),\" \")","v":"KC Instruction"},{"$f":"IF(A564<>\" \",VLOOKUP(I564,ALLOC,2,0),\" \")","v":"KC"},"I",45051,"3411IN",341000,300004]
[45052,"AS","KC Academic Support","KC","AS",45052,"3440AS",344000,300004]
[45053,"IN","KC Instruction","KC","I",45053,"3410IN",341000,300004]
[45054,"FA","KC Scholarships","KC","FA",45054,"3480FA",348000,300004]
[45055,"PZ","KC Public Service","KC","PS",45055,"3430PZ",343000,300004]
[45056,"SS","KC Student Services","KC","SS",45056,"3450SS",345000,300004]
[45057,"IN","KC Instruction","KC","I",45057,"3411IN",341000,300004]
[45058,"ID","KC Instruction","KC","I",45058,"3410ID",341000,300004]
[45059,"RO","KC Research","KC","R",45059,"3420RO",342000,300004]
[45060,"ID","KC Instruction","KC","I",45060,"3410ID",341000,300004]
[45061,"IN","KC Instruction","KC","I",45061,"3411IN",341000,300004]
[45062,"ID","KC Instruction","KC","I",45062,"3410ID",341000,300004]
[45098,"PP","96 CEA Suppl - PP",{"$error":"#N/A"},{"$error":"#N/A"},45098,"0396PP",37000,307100]
[45099,"IN",{"$error":"#N/A"},{"$error":"#N/A"},"I",45099,"0396IN",31000,31100]
[45998,"IN","KC Instruction","KC","I",45998,"3411IN",341000,300004]
[46000,"UX","NC Auxiliary Services","NC",{"$f":"IF(A579<>\" \",VLOOKUP(B579,NCHEMS_ABBR,3,0),\" \")","v":"AUX"},46000,"3590UX",359000,300005]
[46001,"IN","NC Instruction","NC","I",46001,"3511IN",351000,300005]
[46002,"IN","NC Instruction","NC","I",46002,"3511IN",351000,300005]
[46003,"IN","NC Instruction","NC","I",46003,"3511IN",351000,300005]
[46004,"IN","NC Instruction","NC","I",46004,"3511IN",351000,300005]
[46005,"ID","NC Instruction","NC","I",46005,"3510ID",351000,300005]
[46006,"FA","NC Scholarships","NC","FA",46006,"3581FA",358000,300005]
[46007,"IN","NC Instruction","NC","I",46007,"3511IN",351000,300005]
[46008,"IN","NC Instruction","NC","I",46008,"3511IN",351000,300005]
[46009,"IN","NC Instruction","NC","I",46009,"3511IN",351000,300005]
[46010,"IN","NC Instruction","NC","I",46010,"3511IN",351000,300005]
[46011,"ID","NC Instruction","NC","I",46011,"3510ID",351000,300005]
[46012,"FA","NC Scholarships","NC","FA",46012,"3511FA",358000,300005]
[46013,"IN","NC Instruction","NC","I",46013,"3510IN",351000,300005]
[46014,"IN","NC Instruction","NC","I",46014,"3510IN",351000,300005]
[46015,"IN","NC Instruction","NC","I",46015,"3510IN",351000,300005]
[46016,"IN","NC Instruction","NC","I",46016,"3510IN",351000,300005]
[46017,"IN","NC Instruction","NC","I",46017,"3510IN",351000,300005]
[46018,"IN","NC Instruction","NC","I",46018,"3510IN",351000,300005]
[46019,"IN","NC Instruction","NC","I",46019,"3510IN",351000,300005]
[46020,"IN","RC Instruction","RC","I",46020,"3214IN",321000,300006]
[46021,"ID","NC Instruction","NC","I",46021,"3510ID",351000,300005]
[46022,"IN","NC Instruction","NC","I",46022,"3510IN",351000,300005]
[46023,"OM","NC Physical Plant","NC","PP",46023,"3570OM",357000,300005]
[46024,"OM","NC Physical Plant","NC","PP",46024,"3571OM",357000,300005]
[46025,"OM","NC Physical Plant","NC","PP",46025,"3570OM",357000,300005]
[46026,"OM","NC Physical Plant","NC","PP",46026,"3570OM",357000,300005]
[46027,"AS","NC Academic Support","NC","AS",46027,"3540AS",354000,300005]
[46028,"SS","NC Student Services","NC","SS",46028,"3540SS",355000,300005]
[46029,"AS","NC Academic Support","NC","AS",46029,"3540AS",354000,300005]
[46030,"AS","NC Academic Support","NC","AS",46030,"3560AS",354000,300005]
[46031,"AS","NC Academic Support","NC","AS",46031,"3560AS",354000,300005]
[46032,"AS","NC Academic Support","NC","AS",46032,"3540AS",354000,300005]
[46033,"AS","NC Academic Support","NC","AS",46033,"3540AS",354000,300005]
[46034,"AS","NC Academic Support","NC","AS",46034,"3540AS",354000,300005]
[46035,"GA","NC Institutional Support","NC","IS",46035,"3560GA",356000,300005]
[46036,"AL","NC Library Services","NC","L",46036,"3543AL",354500,300005]
[46037,"AL","NC Library Services","NC","L",46037,"3543AL",354500,300005]
[46038,"SS","NC Student Services","NC","SS",46038,"3550SS",355000,300005]
[46039,"SS","NC Student Services","NC","SS",46039,"3550SS",355000,300005]
[46040,"SS","NC Student Services","NC","SS",46040,"3550SS",355000,300005]
[46041,"IN","NC Instruction","NC","I",46041,"3510IN",351000,300005]
[46042,"ID","NC Instruction","NC","I",46042,"3510ID",351000,300005]
[46043,"ID","NC Instruction","NC","I",46043,"3510ID",351000,300005]
[46044,"ID","NC Instruction","NC","I",46044,"3510ID",351000,300005]
[46045,"ID","NC Instruction","NC","I",46045,"3510ID",351000,300005]
[46046,"ID","NC Instruction","NC","I",46046,"3510ID",351000,300005]
[46047,"IN","NC Instruction","NC","I",46047,"3510IN",351000,300005]
[46048,"FA","NC Scholarships","NC","FA",46048,"3581FA",358000,300005]
[{"$f":"IF(F628>0,VALUE(F628),\" \")","v":46049},{"$f":"IF(A628<>\" \",RIGHT(G628,2),\" \")","v":"OM"},{"$f":"IF(A628<>\" \",VLOOKUP(H628,ALLOC_NCHEMS,2,0),\" \")","v":"RC Physical Plant"},{"$f":"IF(A628<>\" \",VLOOKUP(I628,ALLOC,2,0),\" \")","v":"RC"},"PP",46049,"3272OM",327000,300006]
[46050,"ID","NC Instruction","NC","I",46050,"3510ID",351000,300005]
[46051,"ID","NC Instruction","NC","I",46051,"3510ID",351000,300005]
[46052,"ID","NC Instruction","NC","I",46052,"3510ID",351000,300005]
[46053,"PS","NC Public Service","NC","PS",46053,"3530PS",353000,300005]
[46054,"RO","NC Research","NC","R",46054,"3520RO",352000,300005]
[46055,"PS","NC Public Service","NC","PS",46055,"3530PS",353000,300005]
[46056,"IN","NC Instruction","NC","I",46056,"3511IN",351000,300005]
[46057,"FA","NC Scholarships","NC","FA",46057,"3581FA",358000,300005]
[46058,"IN","NC Instruction","NC","I",46058,"3511IN",351000,300005]
[46059,"SS","NC Student Services","NC","SS",46059,"3540SS",355000,300005]
[46060,"AZ","NC Academic Support","NC","AS",46060,"3540AZ",354000,300005]
[46061,"IN","NC Instruction","NC","I",46061,"3510IN",351000,300005]
[46062,"ID","NC Instruction","NC","I",46062,"3510ID",351000,300005]
[46098,"PP","96 CEA Suppl - PP",{"$error":"#N/A"},{"$error":"#N/A"},46098,"0396PP",37000,307100]
[46099,"IN",{"$error":"#N/A"},{"$error":"#N/A"},{"$f":"IF(A643<>\" \",VLOOKUP(B643,NCHEMS_ABBR,3,0),\" \")","v":"I"},46099,"0396IN",31000,31100]
[46998,"IN","NC Instruction","NC","I",46998,"3511IN",351000,300005]
[47000,"UX","RC Auxiliary Service","RC","AUX",47000,"3292UX",329000,300006]
[47001,"IN","RC Instruction","RC","I",47001,"3215IN",321000,300006]
[47002,"IN","RC Instruction","RC","I",47002,"3215IN",321000,300006]
[47003,"ID","RC Instruction","RC","I",47003,"3213ID",321000,300006]
[47004,"IN","FC Instruction","FC","I",47004,"3017IN",301000,300001]
[47005,"AS","FC Academic Support","FC","AS",47005,"3048AS",304000,300001]
[47006,"IM","FC Instruction","FC","I",47006,"3017IM",301000,300001]
[47007,"IN","FC Instruction","FC","I",47007,"3017IN",301000,300001]
[47008,"IN","RC Instruction","RC","I",47008,"3213IN",321000,300006]
[47009,"ID","FC Instruction","FC","I",47009,"3017ID",301000,300001]
[47010,"IN","RC Instruction","RC","I",47010,"3213IN",321000,300006]
[47011,"FA","RC Student Loans & Schol","RC","FA",47011,"3282FA",328000,300006]
[47012,"AS","FC Academic Support","FC","AS",47012,"3048AS",304000,300001]
[47013,"AS","FC Academic Support","FC","AS",47013,"3048AS",304000,300001]
[47014,"AS","RC Academic Support","RC","AS",47014,"3242AS",324000,300006]
[47015,"AS","FC Academic Support","FC","AS",47015,"3048AS",304000,300001]
[47016,"ID","RC Instruction","RC","I",47016,"3213ID",321000,300006]
[47017,"AS","RC Academic Support","RC","AS",47017,"3244AS",324000,300006]
[47018,"OM","RC Physical Plant","RC","PP",47018,"3272OM",327000,300006]
[47019,"OM","RC Physical Plant","RC","PP",47019,"3272OM",327000,300006]
[47020,"RO","RC Research","RC","R",47020,"3220RO",322000,300006]
[47021,"ID","RC Instruction","RC","I",47021,"3213ID",321000,300006]
[47022,"ID","RC Instruction","RC","I",47022,"3213ID",321000,300006]
[47023,"ID","RC Instruction","RC","I",47023,"3213ID",321000,300006]
[47024,"AS","FC Academic Support","FC","AS",47024,"3048AS",304000,300001]
[47025,"ID","RC Instruction","RC","I",47025,"3213ID",321000,300006]
[47026,"ID","FC Instruction","FC","I",47026,"3017ID",301000,300001]
[47027,"IN","RC Instruction","RC","I",47027,"3213IN",321000,300006]
[47028,"AS","RC Academic Support","RC","AS",47028,"3244AS",324000,300006]
[47029,"ID","RC Instruction","RC","I",47029,"3213ID",321000,300006]
[47030,"FA","RC Student Loans & Schol","RC","FA",47030,"3282FA",328000,300006]
[47031,"AS","RC Academic Support","RC","AS",47031,"3244AS",324000,300006]
[47032,"AS","RC Academic Support","RC","AS",47032,"3244AS",324000,300006]
[47033,"ID","RC Instruction","RC","I",47033,"3213ID",321000,300006]
[47034,"ID","RC Instruction","RC","I",47034,"3213ID",321000,300006]
[47035,"PS","RC Public Service","RC","PS",47035,"3230PS",323000,300006]
[47036,"AS","RC Academic Support","RC","AS",47036,"3244AS",324000,300006]
[47037,"SS","FC Student Services","FC","SS",47037,"3052SS",305000,300001]
[47038,"AY","FC Academic Support","FC","AS",47038,"304DAY",304000,300001]
[47039,"AS","RC Academic Support","RC","AS",47039,"3242AS",324000,300006]
[47040,"AS","RC Academic Support","RC","AS",47040,"3244AS",324000,300006]
[47041,"AS","RC Academic Support","RC","AS",47041,"3242AS",324000,300006]
[47042,"AS","RC Academic Support","RC","AS",47042,"3244AS",324000,300006]
[47043,"FA","RC Student Loans & Schol","RC","FA",47043,"3282FA",328000,300006]
[47044,"AS","RC Academic Support","RC","AS",47044,"3242AS",324000,300006]
[47045,"IN","RC Instruction","RC","I",47045,"3213IN",321000,300006]
[47046,"ID","RC Instruction","RC","I",47046,"3213ID",321000,300006]
[{"$f":"IF(F692>0,VALUE(F692),\" \")","v":47047},{"$f":"IF(A692<>\" \",RIGHT(G692,2),\" \")","v":"PS"},{"$f":"IF(A692<>\" \",VLOOKUP(H692,ALLOC_NCHEMS,2,0),\" \")","v":"RC Public Service"},{"$f":"IF(A692<>\" \",VLOOKUP(I692,ALLOC,2,0),\" \")","v":"RC"},"PS",47047,"3230PS",323000,300006]
[47048,"IN","RC Instruction","RC","I",47048,"3213IN",321000,300006]
[47049,"ID","RC Instruction","RC","I",47049,"3213ID",321000,300006]
[47050,"IN","RC Instruction","RC","I",47050,"3215IN",321000,300006]
[47051,"IN","FC Instruction","FC","I",47051,"3017IN",301000,300001]
[47052,"AS","RC Academic Support","RC","AS",47052,"3244AS",324000,300006]
[47053,"IN","RC Instruction","RC","I",47053,"3213IN",321000,300006]
[47054,"IN","RC Instruction","RC","I",47054,"3213IN",321000,300006]
[47055,"ID","RC Instruction","RC","I",47055,"3213ID",321000,300006]
[47056,"AS","RC Academic Support","RC","AS",47056,"3244AS",324000,300006]
[47057,"AS","RC Academic Support","RC","AS",47057,"3242AS",324000,300006]
[47058,"AS","RC Academic Support","RC","AS",47058,"3242AS",324000,300006]
[47059,"AS","RC Academic Support","RC","AS",47059,"3242AS",324000,300006]
[47060,"IN","RC Instruction","RC","I",47060,"3213IN",321000,300006]
[47061,"ID","FC Instruction","FC","I",47061,"3017ID",301000,300001]
[47062,"ID","RC Instruction","RC",{"$f":"IF(A707<>\" \",VLOOKUP(B707,NCHEMS_ABBR,3,0),\" \")","v":"I"},47062,"3213ID",321000,300006]
[47063,"ID","RC Instruction","RC","I",47063,"3213ID",321000,300006]
[47064,"IN","RC Instruction","RC","I",47064,"3213IN",321000,300006]
[47065,"IN","RC Instruction","RC","I",47065,"3213IN",321000,300006]
[47066,"AS","RC Academic Support","RC","AS",47066,"3244AS",324000,300006]
[47067,"OM","RC Physical Plant","RC","PP",47067,"3272OM",327000,300006]
[47068,"AS","RC Academic Support","RC","AS",47068,"3244AS",324000,300006]
[47069,"SS","RC Student Services","RC","SS",47069,"3250SS",325000,300006]
[47070,"UZ","RC Auxiliary Service","RC","AUX",47070,"3292UZ",329000,300006]
[47071,"FA","RC Student Loans & Schol","RC","FA",47071,"3282FA",328000,300006]
[47072,"FA","RC Student Loans & Schol","RC","FA",47072,"3282FA",328000,300006]
[47073,"UX","RC Auxiliary Service","RC","AUX",47073,"3292UX",329000,300006]
[47074,"UM","RC Auxiliary Service","RC","AUX",47074,"3290UM",329000,300006]
[47075,"SZ","RC Student Services","RC","SS",47075,"3250SZ",325000,300006]
[47076,"ID","RC Instruction","RC","I",47076,"3213ID",321000,300006]
[47077,"UM","RC Auxiliary Service","RC","AUX",47077,"3290UM",329000,300006]
[47078,"OM","RC Physical Plant","RC","PP",47078,"3272OM",327000,300006]
[47079,"OM","RC Physical Plant","RC","PP",47079,"3272OM",327000,300006]
[47080,"ID","RC Instruction","RC","I",47080,"3213ID",321000,300006]
[47081,"IN","RC Instruction","RC","I",47081,"3213IN",321000,300006]
[47082,"FA","RC Student Loans & Schol","RC","FA",47082,"3282FA",328000,300006]
[47083,"IN","RC Instruction","RC","I",47083,"3213IN",321000,300006]
[47084,"PS","RC Public Service","RC","PS",47084,"3230PS",323000,300006]
[47085,"AS","RC Academic Support","RC","AS",47085,"3244AS",324000,300006]
[47086,"ID","RC Instruction","RC","I",47086,"3213ID",321000,300006]
[47087,"FA","RC Student Loans & Schol","RC","FA",47087,"3282FA",328000,300006]
[47088,"ID","RC Instruction","RC","I",47088,"3213ID",321000,300006]
[47089,"IN","RC Instruction","RC","I",47089,"3213IN",321000,300006]
[47090,"FA","FC Scholarships","FC","FA",47090,"3083FA",308000,300001]
[47091,"UX","RC Auxiliary Service","RC","AUX",47091,"3292UX",329000,300006]
[47092,"IN","RC Instruction","RC","I",47092,"3215IN",321000,300006]
[47093,"ID","RC Instruction","RC","I",47093,"3213ID",321000,300006]
[47094,"PS","RC Public Service","RC","PS",47094,"3230PS",323000,300006]
[47095,"PS","RC Public Service","RC","PS",47095,"3230PS",323000,300006]
[47096,"PS","FC Public Service","FC","PS",47096,"3030PS",303000,300001]
[47097,"IN","RC Instruction","RC","I",47097,"3213IN",321000,300006]
[47099,"ID","RC Instruction","RC","I",47099,"3213ID",321000,300006]
[47998,"IN","RC Instruction","RC","I",47998,"3213IN",321000,300006]
[48000,"IN","CTC Instruction","CTC","I",48000,"3610IN",361000,300010]
[48001,"IN","CTC Instruction","CTC","I",48001,"3610IN",361000,300010]
[48002,"IN","CTC Instruction","CTC","I",48002,"3610IN",361000,300010]
[48003,"IN","CTC Instruction","CTC","I",48003,"3610IN",361000,300010]
[48004,"AZ","CTC Academic Support","CTC","AS",48004,"3640AZ",364000,300010]
[48005,"IN","CTC Instruction","CTC","I",48005,"3610IN",361000,300010]
[48006,"SS","CTC Student Services","CTC","SS",48006,"3650SS",365000,300010]
[48007,"IN","CTC Instruction","CTC","I",48007,"3610IN",361000,300010]
[48008,"IN","CTC Instruction","CTC","I",48008,"3610IN",361000,300010]
[48009,"IN","CTC Instruction","CTC","I",48009,"3611IN",361000,300010]
[48010,"IN","CTC Instruction","CTC","I",48010,"3611IN",361000,300010]
[{"$f":"IF(F756>0,VALUE(F756),\" \")","v":48011},{"$f":"IF(A756<>\" \",RIGHT(G756,2),\" \")","v":"IN"},{"$f":"IF(A756<>\" \",VLOOKUP(H756,ALLOC_NCHEMS,2,0),\" \")","v":"CTC Instruction"},{"$f":"IF(A756<>\" \",VLOOKUP(I756,ALLOC,2,0),\" \")","v":"CTC"},"I",48011,"3611IN",361000,300010]
[48012,"IN","CTC Instruction","CTC","I",48012,"3611IN",361000,300010]
[48013,"IN","CTC Instruction","CTC","I",48013,"3611IN",361000,300010]
[48014,"IN","CTC Instruction","CTC","I",48014,"3611IN",361000,300010]
[48015,"IN","CTC Instruction","CTC","I",48015,"3611IN",361000,300010]
[48016,"IN","CTC Instruction","CTC","I",48016,"3611IN",361000,300010]
[48017,"IN","CTC Instruction","CTC","I",48017,"3611IN",361000,300010]
[48018,"IN","CTC Instruction","CTC","I",48018,"3611IN",361000,300010]
[48019,"IN","CTC Instruction","CTC","I",48019,"3611IN",361000,300010]
[48020,"IN","CTC Instruction","CTC","I",48020,"3611IN",361000,300010]
[48021,"PS","CTC Public Service","CTC","PS",48021,"3611PS",363000,300010]
[48022,"IN","CTC Instruction","CTC","I",48022,"3611IN",361000,300010]
[48023,"IN","CTC Instruction","CTC","I",48023,"3611IN",361000,300010]
[48024,"IN","CTC Instruction","CTC","I",48024,"3611IN",361000,300010]
[48025,"AS","CTC Academic Support","CTC","AS",48025,"3640AS",364000,300010]
[48026,"IN","CTC Instruction","CTC",{"$f":"IF(A771<>\" \",VLOOKUP(B771,NCHEMS_ABBR,3,0),\" \")","v":"I"},48026,"3611IN",361000,300010]
[48027,"IN","CTC Instruction","CTC","I",48027,"3611IN",361000,300010]
[48028,"IN","CTC Instruction","CTC","I",48028,"3611IN",361000,300010]
[48029,"IN","CTC Instruction","CTC","I",48029,"3611IN",361000,300010]
[48030,"IN","CTC Instruction","CTC","I",48030,"3611IN",361000,300010]
[48031,"AS","CTC Academic Support","CTC","AS",48031,"3640AS",364000,300010]
[48032,"AS","CTC Academic Support","CTC","AS",48032,"3640AS",364000,300010]
[48033,"IN","CTC Instruction","CTC","I",48033,"3610IN",361000,300010]
[48034,"FA","CTC Scholarships","CTC","FA",48034,"3611FA",368000,300010]
[48035,"IN","CTC Instruction","CTC","I",48035,"3611IN",361000,300010]
[48036,"GA","CTC Institutional Support","CTC","IS",48036,"3612GA",366000,300010]
[48038,"IN","CTC Instruction","CTC","I",48038,"3611IN",361000,300010]
[48039,"OM","CTC Physical Plant","CTC","PP",48039,"3610OM",367000,300010]
[48040,"AS","CTC Academic Support","CTC","AS",48040,"3640AS",364000,300010]
[48041,"AS","CTC Academic Support","CTC","AS",48041,"3640AS",364000,300010]
[48042,"ID","CTC Instruction","CTC","I",48042,"3610ID",361000,300010]
[48043,"ID","CTC Instruction","CTC","I",48043,"3610ID",361000,300010]
[48044,"OM","CTC Physical Plant","CTC","PP",48044,"3610OM",367000,300010]
[48045,"IN","CTC Instruction","CTC","I",48045,"3611IN",361000,300010]
[48046,"IN","CTC Instruction","CTC","I",48046,"3611IN",361000,300010]
[48047,"IN","CTC Instruction","CTC","I",48047,"3611IN",361000,300010]
[48048,"IN","CTC Instruction","CTC","I",48048,"3611IN",361000,300010]
[48049,"IN","CTC Instruction","CTC","I",48049,"3611IN",361000,300010]
[48050,"SS","CTC Student Services","CTC","SS",48050,"3650SS",365000,300010]
[48051,"IN","CTC Instruction","CTC","I",48051,"3611IN",361000,300010]
[48052,"IN","CTC Instruction","CTC","I",48052,"3611IN",361000,300010]
[48053,"IN","CTC Instruction","CTC","I",48053,"3611IN",361000,300010]
[48054,"IN","CTC Instruction","CTC","I",48054,"3611IN",361000,300010]
[48055,"IN","CTC Instruction","CTC","I",48055,"3611IN",361000,300010]
[48056,"IN","CTC Instruction","CTC","I",48056,"3611IN",361000,300010]
[48057,"IN","CTC Instruction","CTC","I",48057,"3611IN",361000,300010]
[48058,"IN","CTC Instruction","CTC","I",48058,"3611IN",361000,300010]
[48059,"IN","CTC Instruction","CTC","I",48059,"3611IN",361000,300010]
[48060,"IN","CTC Instruction","CTC","I",48060,"3610IN",361000,300010]
[48061,"OM","CTC Physical Plant","CTC","PP",48061,"3610OM",367000,300010]
[48062,"IN","CTC Instruction","CTC","I",48062,"3611IN",361000,300010]
[48063,"IN","CTC Instruction","CTC","I",48063,"3611IN",361000,300010]
[48064,"IN",{"$error":"#N/A"},{"$error":"#N/A"},"I",48064,"1010IN",101000,100001]
[48065,"IN","CTC Instruction","CTC","I",48065,"3610IN",361000,300010]
[48066,"IN","CTC Instruction","CTC","I",48066,"3610IN",361000,300010]
[48067,"SS","CTC Student Services","CTC","SS",48067,"3650SS",365000,300010]
[48068,"IN","CTC Instruction","CTC","I",48068,"3610IN",361000,300010]
[48069,"IN","CTC Instruction","CTC","I",48069,"3610IN",361000,300010]
[48070,"IN","CTC Instruction","CTC","I",48070,"3610IN",361000,300010]
[48071,"IN","CTC Instruction","CTC","I",48071,"3610IN",361000,300010]
[48072,"IN","CTC Instruction","CTC","I",48072,"3610IN",361000,300010]
[48073,"IN","CTC Instruction","CTC","I",48073,"3610IN",361000,300010]
[48074,"IN","CTC Instruction","CTC","I",48074,"3611IN",361000,300010]
[48075,"AZ","CTC Academic Support","CTC","AS",48075,"3640AZ",364000,300010]
[{"$f":"IF(F820>0,VALUE(F820),\" \")","v":48076},{"$f":"IF(A820<>\" \",RIGHT(G820,2),\" \")","v":"AS"},{"$f":"IF(A820<>\" \",VLOOKUP(H820,ALLOC_NCHEMS,2,0),\" \")","v":"CTC Academic Support"},{"$f":"IF(A820<>\" \",VLOOKUP(I820,ALLOC,2,0),\" \")","v":"CTC"},"AS",48076,"3640AS",364000,300010]
[48077,"OM","CTC Physical Plant","CTC","PP",48077,"3610OM",367000,300010]
[48078,"IN","CTC Instruction","CTC","I",48078,"3611IN",361000,300010]
[48079,"OM","CTC Physical Plant","CTC","PP",48079,"3610OM",367000,300010]
[48080,"OM","CTC Physical Plant","CTC","PP",48080,"3610OM",367000,300010]
[48081,"IN","CTC Instruction","CTC","I",48081,"3611IN",361000,300010]
[48082,"OM","CTC Physical Plant","CTC","PP",48082,"3610OM",367000,300010]
[48083,"AS","CTC Academic Support","CTC","AS",48083,"3640AS",364000,300010]
[48084,"SS","CTC Student Services","CTC","SS",48084,"3650SS",365000,300010]
[48085,"IN","CTC Instruction","CTC","I",48085,"3611IN",361000,300010]
[48086,"AZ","CTC Academic Support","CTC","AS",48086,"3640AZ",364000,300010]
[48087,"IN","CTC Instruction","CTC","I",48087,"3611IN",361000,300010]
[48088,"IN","CTC Instruction","CTC","I",48088,"3611IN",361000,300010]
[48098,"PP","96 CEA Suppl - PP",{"$error":"#N/A"},{"$error":"#N/A"},48098,"0396PP",37000,307100]
[48100,"ID","CTC Instruction","CTC","I",48100,"3611ID",361000,300010]
[48101,"ID","CTC Instruction","CTC",{"$f":"IF(A835<>\" \",VLOOKUP(B835,NCHEMS_ABBR,3,0),\" \")","v":"I"},48101,"3611ID",361000,300010]
[48102,"ID","CTC Instruction","CTC","I",48102,"3611ID",361000,300010]
[48103,"ID","CTC Instruction","CTC","I",48103,"3611ID",361000,300010]
[48107,"ID","CTC Instruction","CTC","I",48107,"3611ID",361000,300010]
[48108,"ID","CTC Instruction","CTC","I",48108,"3611ID",361000,300010]
[48109,"ID","CTC Instruction","CTC","I",48109,"3611ID",361000,300010]
[48110,"ID","CTC Instruction","CTC","I",48110,"3611ID",361000,300010]
[48111,"ID","CTC Instruction","CTC","I",48111,"3611ID",361000,300010]
[48112,"ID","CTC Instruction","CTC","I",48112,"3611ID",361000,300010]
[48113,"ID","CTC Instruction","CTC","I",48113,"3611ID",361000,300010]
[48114,"ID","CTC Instruction","CTC","I",48114,"3611ID",361000,300010]
[48115,"ID","CTC Instruction","CTC","I",48115,"3611ID",361000,300010]
[48116,"ID","CTC Instruction","CTC","I",48116,"3611ID",361000,300010]
[48117,"ID","CTC Instruction","CTC","I",48117,"3611ID",361000,300010]
[48118,"ID","CTC Instruction","CTC","I",48118,"3611ID",361000,300010]
[48119,"ID","CTC Instruction","CTC","I",48119,"3611ID",361000,300010]
[48122,"ID","CTC Instruction","CTC","I",48122,"3611ID",361000,300010]
[48127,"ID","CTC Instruction","CTC","I",48127,"3611ID",361000,300010]
[48128,"ID","CTC Instruction","CTC","I",48128,"3611ID",361000,300010]
[48129,"ID","CTC Instruction","CTC","I",48129,"3611ID",361000,300010]
[48130,"IN","CTC Instruction","CTC","I",48130,"3611IN",361000,300010]
[48131,"IN","CTC Instruction","CTC","I",48131,"3611IN",361000,300010]
[48132,"IN","CTC Instruction","CTC","I",48132,"3611IN",361000,300010]
[48133,"IN","CTC Instruction","CTC","I",48133,"3611IN",361000,300010]
[48134,"IN","CTC Instruction","CTC","I",48134,"3611IN",361000,300010]
[48139,"ID","CTC Instruction","CTC","I",48139,"3611ID",361000,300010]
[48146,"ID","CTC Instruction","CTC","I",48146,"3611ID",361000,300010]
[48148,"ID","CTC Instruction","CTC","I",48148,"3611ID",361000,300010]
[48151,"ID","CTC Instruction","CTC","I",48151,"3611ID",361000,300010]
[48153,"ID","CTC Instruction","CTC","I",48153,"3611ID",361000,300010]
[48157,"ID","CTC Instruction","CTC","I",48157,"3611ID",361000,300010]
[48158,"ID","CTC Instruction","CTC","I",48158,"3611ID",361000,300010]
[48159,"ID","CTC Instruction","CTC","I",48159,"3611ID",361000,300010]
[48162,"ID","CTC Instruction","CTC","I",48162,"3611ID",361000,300010]
[48163,"ID","CTC Instruction","CTC","I",48163,"3611ID",361000,300010]
[48165,"ID","CTC Instruction","CTC","I",48165,"3611ID",361000,300010]
[48166,"ID","CTC Instruction","CTC","I",48166,"3611ID",361000,300010]
[48168,"ID","CTC Instruction","CTC","I",48168,"3611ID",361000,300010]
[48169,"ID","CTC Instruction","CTC","I",48169,"3611ID",361000,300010]
[48174,"ID","CTC Instruction","CTC","I",48174,"3611ID",361000,300010]
[48185,"ID","CTC Instruction","CTC","I",48185,"3611ID",361000,300010]
[48187,"ID","CTC Instruction","CTC","I",48187,"3611ID",361000,300010]
[48188,"ID","CTC Instruction","CTC","I",48188,"3611ID",361000,300010]
[48211,"IN","CTC Instruction","CTC","I",48211,"3611IN",361000,300010]
[48216,"IN","CTC Instruction","CTC","I",48216,"3611IN",361000,300010]
[48230,"IN","CTC Instruction","CTC","I",48230,"3611IN",361000,300010]
[48257,"IN","CTC Instruction","CTC","I",48257,"3611IN",361000,300010]
[48998,"IN","CTC Instruction","CTC","I",48998,"3610IN",361000,300010]
[50000,"GA","FC Institutional Support","FC","IS",50000,"3061GA",306000,300001]
[{"$f":"IF(F884>0,VALUE(F884),\" \")","v":50001},{"$f":"IF(A884<>\" \",RIGHT(G884,2),\" \")","v":"GA"},{"$f":"IF(A884<>\" \",VLOOKUP(H884,ALLOC_NCHEMS,2,0),\" \")","v":"FC Institutional Support"},{"$f":"IF(A884<>\" \",VLOOKUP(I884,ALLOC,2,0),\" \")","v":"FC"},"IS",50001,"3061GA",306000,300001]
[50002,"GA","FC Institutional Support","FC","IS",50002,"3061GA",306000,300001]
[50003,"GP","FC Institutional Support","FC","IS",50003,"3061GP",306000,300001]
[50004,"GP","FC Institutional Support","FC","IS",50004,"3061GP",306000,300001]
[50005,"GP","FC Institutional Support","FC","IS",50005,"3061GP",306000,300001]
[50006,"OM","FC Physical Plant","FC","PP",50006,"3070OM",307000,300001]
[50007,"OM","FC Physical Plant","FC","PP",50007,"3070OM",307000,300001]
[50008,"OM","FC Physical Plant","FC","PP",50008,"3070OM",307000,300001]
[50009,"OY","FC Physical Plant","FC","PP",50009,"3070OY",307000,300001]
[50010,"OM","FC Physical Plant","FC","PP",50010,"3070OM",307000,300001]
[50011,"OM","FC Physical Plant","FC","PP",50011,"3070OM",307000,300001]
[50012,"OM","FC Physical Plant","FC","PP",50012,"3072OM",307000,300001]
[50013,"OM","FC Physical Plant","FC","PP",50013,"3070OM",307000,300001]
[50014,"OM","FC Physical Plant","FC","PP",50014,"3070OM",307000,300001]
[50015,"OM","FC Physical Plant","FC","PP",50015,"3070OM",307000,300001]
[50016,"OM","FC Physical Plant","FC",{"$f":"IF(A899<>\" \",VLOOKUP(B899,NCHEMS_ABBR,3,0),\" \")","v":"PP"},50016,"3070OM",307000,300001]
[50017,"OM","FC Physical Plant","FC","PP",50017,"3072OM",307000,300001]
[50018,"OM","FC Physical Plant","FC","PP",50018,"3070OM",307000,300001]
[50019,"OM","FC Physical Plant","FC","PP",50019,"3070OM",307000,300001]
[50020,"OM","FC Physical Plant","FC","PP",50020,"3070OM",307000,300001]
[50021,"OM","FC Physical Plant","FC","PP",50021,"3070OM",307000,300001]
[50022,"OM","FC Physical Plant","FC","PP",50022,"3070OM",307000,300001]
[50023,"OM","FC Physical Plant","FC","PP",50023,"3070OM",307000,300001]
[50024,"OM","FC Physical Plant","FC","PP",50024,"3070OM",307000,300001]
[50025,"OY","FC Physical Plant","FC","PP",50025,"3070OY",307000,300001]
[50026,"OM","FC Physical Plant","FC","PP",50026,"3070OM",307000,300001]
[50027,"OM","FC Physical Plant","FC","PP",50027,"3070OM",307000,300001]
[50028,"OM","FC Physical Plant","FC","PP",50028,"3070OM",307000,300001]
[50029,"OM","FC Physical Plant","FC","PP",50029,"3070OM",307000,300001]
[50030,"OM","FC Physical Plant","FC","PP",50030,"3070OM",307000,300001]
[50031,"OM","FC Physical Plant","FC","PP",50031,"3070OM",307000,300001]
[50032,"OM","FC Physical Plant","FC","PP",50032,"3070OM",307000,300001]
[50033,"OM","FC Physical Plant","FC","PP",50033,"3070OM",307000,300001]
[50034,"OM","FC Physical Plant","FC","PP",50034,"3070OM",307000,300001]
[50035,"OM","FC Physical Plant","FC","PP",50035,"3070OM",307000,300001]
[50036,"OM","FC Physical Plant","FC","PP",50036,"3070OM",307000,300001]
[50037,"OM","FC Physical Plant","FC","PP",50037,"3070OM",307000,300001]
[50038,"OM","FC Physical Plant","FC","PP",50038,"3070OM",307000,300001]
[50039,"OM","FC Physical Plant","FC","PP",50039,"3070OM",307000,300001]
[50040,"OM","FC Physical Plant","FC","PP",50040,"3070OM",307000,300001]
[50041,"OM","FC Physical Plant","FC","PP",50041,"3070OM",307000,300001]
[50042,"OM","FC Physical Plant","FC","PP",50042,"3070OM",307000,300001]
[50043,"OM","FC Physical Plant","FC","PP",50043,"3070OM",307000,300001]
[50044,"OM","FC Physical Plant","FC","PP",50044,"3070OM",307000,300001]
[50045,"OM","FC Physical Plant","FC","PP",50045,"3070OM",307000,300001]
[50046,"OM","FC Physical Plant","FC","PP",50046,"3070OM",307000,300001]
[50047,"OM","FC Physical Plant","FC","PP",50047,"3070OM",307000,300001]
[50048,"OM","FC Physical Plant","FC","PP",50048,"3070OM",307000,300001]
[50049,"OM","FC Physical Plant","FC","PP",50049,"3070OM",307000,300001]
[50050,"OM","FC Physical Plant","FC","PP",50050,"3070OM",307000,300001]
[50051,"OM","FC Physical Plant","FC","PP",50051,"3070OM",307000,300001]
[50052,"OM","FC Physical Plant","FC","PP",50052,"3070OM",307000,300001]
[50053,"OM","FC Physical Plant","FC","PP",50053,"3070OM",307000,300001]
[50054,"OM","FC Physical Plant","FC","PP",50054,"3070OM",307000,300001]
[50055,"OM","FC Physical Plant","FC","PP",50055,"3070OM",307000,300001]
[50056,"OM","FC Physical Plant","FC","PP",50056,"3070OM",307000,300001]
[50057,"OM","FC Physical Plant","FC","PP",50057,"3070OM",307000,300001]
[50058,"PS","FC Public Service","FC","PS",50058,"3077PS",303000,300001]
[50059,"OM","FC Physical Plant","FC","PP",50059,"3070OM",307000,300001]
[50060,"OM","FC Physical Plant","FC","PP",50060,"3070OM",307000,300001]
[50061,"OM","FC Physical Plant","FC","PP",50061,"3070OM",307000,300001]
[50062,"OM","FC Physical Plant","FC","PP",50062,"3070OM",307000,300001]
[50063,"OM","FC Physical Plant","FC","PP",50063,"3070OM",307000,300001]
[50064,"OM","FC Physical Plant","FC","PP",50064,"3070OM",307000,300001]
[{"$f":"IF(F948>0,VALUE(F948),\" \")","v":50065},{"$f":"IF(A948<>\" \",RIGHT(G948,2),\" \")","v":"OM"},{"$f":"IF(A948<>\" \",VLOOKUP(H948,ALLOC_NCHEMS,2,0),\" \")","v":"FC Physical Plant"},{"$f":"IF(A948<>\" \",VLOOKUP(I948,ALLOC,2,0),\" \")","v":"FC"},"PP",50065,"3070OM",307000,300001]
[50066,"OM","FC Physical Plant","FC","PP",50066,"3070OM",307000,300001]
[50067,"OM","FC Physical Plant","FC","PP",50067,"3070OM",307000,300001]
[50068,"OM","FC Physical Plant","FC","PP",50068,"3070OM",307000,300001]
[50069,"OM","FC Physical Plant","FC","PP",50069,"3070OM",307000,300001]
[50070,"OM","FC Physical Plant","FC","PP",50070,"3070OM",307000,300001]
[50071,"OM","FC Physical Plant","FC","PP",50071,"3070OM",307000,300001]
[50072,"OM","FC Physical Plant","FC","PP",50072,"3070OM",307000,300001]
[50073,"OM","FC Physical Plant","FC","PP",50073,"3070OM",307000,300001]
[50074,"OM","FC Physical Plant","FC","PP",50074,"3070OM",307000,300001]
[50075,"OM","FC Physical Plant","FC","PP",50075,"3070OM",307000,300001]
[50076,"OM","FC Physical Plant","FC","PP",50076,"3070OM",307000,300001]
[50077,"OM","FC Physical Plant","FC","PP",50077,"3070OM",307000,300001]
[50078,"GA","FC Institutional Support","FC","IS",50078,"3068GA",306000,300001]
[50079,"OM","FC Physical Plant","FC","PP",50079,"3070OM",307000,300001]
[50080,"OM","FC Physical Plant","FC",{"$f":"IF(A963<>\" \",VLOOKUP(B963,NCHEMS_ABBR,3,0),\" \")","v":"PP"},50080,"3070OM",307000,300001]
[50081,"OM","FC Physical Plant","FC","PP",50081,"3070OM",307000,300001]
[50082,"OM","FC Physical Plant","FC","PP",50082,"3070OM",307000,300001]
[50083,"OM","FC Physical Plant","FC","PP",50083,"3070OM",307000,300001]
[50084,"OM","FC Physical Plant","FC","PP",50084,"3070OM",307000,300001]
[50085,"OM","FC Physical Plant","FC","PP",50085,"3070OM",307000,300001]
[50086,"OM","FC Physical Plant","FC","PP",50086,"3070OM",307000,300001]
[50087,"OM","FC Physical Plant","FC","PP",50087,"3070OM",307000,300001]
[50088,"OM","FC Physical Plant","FC","PP",50088,"3070OM",307000,300001]
[50089,"OM","FC Physical Plant","FC","PP",50089,"3070OM",307000,300001]
[50090,"OM","FC Physical Plant","FC","PP",50090,"3070OM",307000,300001]
[50091,"GA","FC Institutional Support","FC","IS",50091,"3068GA",306000,300001]
[50092,"OM","FC Physical Plant","FC","PP",50092,"3070OM",307000,300001]
[50093,"OM","FC Physical Plant","FC","PP",50093,"3070OM",307000,300001]
[50094,"GA","FC Institutional Support","FC","IS",50094,"3067GA",306000,300001]
[50095,"OM","FC Physical Plant","FC","PP",50095,"3070OM",307000,300001]
[50096,"GA","FC Institutional Support","FC","IS",50096,"3061GA",306000,300001]
[50097,"GY","FC Institutional Support","FC","IS",50097,"3061GY",306000,300001]
[50098,"GA","FC Institutional Support","FC","IS",50098,"3061GA",306000,300001]
[50099,"OM","FC Physical Plant","FC","PP",50099,"3074OM",307000,300001]
[50100,"GZ","FC Institutional Support","FC","IS",50100,"3061GZ",306000,300001]
[50101,"GM","FC Institutional Support","FC","IS",50101,"3061GM",306000,300001]
[50102,"OM","FC Physical Plant","FC","PP",50102,"3070OM",307000,300001]
[50103,"OM","FC Physical Plant","FC","PP",50103,"3070OM",307000,300001]
[50104,"OY","FC Physical Plant","FC","PP",50104,"3073OY",307000,300001]
[50105,"OM","FC Physical Plant","FC","PP",50105,"3070OM",307000,300001]
[50106,"OM","FC Physical Plant","FC","PP",50106,"3073OM",307000,300001]
[50107,"OM","FC Physical Plant","FC","PP",50107,"3073OM",307000,300001]
[50108,"OM","FC Physical Plant","FC","PP",50108,"3073OM",307000,300001]
[50109,"OM","FC Physical Plant","FC","PP",50109,"3073OM",307000,300001]
[50110,"OM","FC Physical Plant","FC","PP",50110,"3073OM",307000,300001]
[50111,"OM","FC Physical Plant","FC","PP",50111,"3073OM",307000,300001]
[50112,"OY","FC Physical Plant","FC","PP",50112,"3073OY",307000,300001]
[50113,"RR","FOR Research","FOR","R",50113,"2320RR",382000,300002]
[50114,"RR","FOR Research","FOR","R",50114,"2320RR",382000,300002]
[50115,"RR","FOR Research","FOR","R",50115,"2320RR",382000,300002]
[50116,"RR","FOR Research","FOR","R",50116,"2320RR",382000,300002]
[50117,"RR","FOR Research","FOR","R",50117,"2320RR",382000,300002]
[50118,"OM","FC Physical Plant","FC","PP",50118,"3074OM",307000,300001]
[50119,"OM","FC Physical Plant","FC","PP",50119,"3074OM",307000,300001]
[50120,"OY","FC Physical Plant","FC","PP",50120,"3075OY",307000,300001]
[50121,"OY","FC Physical Plant","FC","PP",50121,"3075OY",307000,300001]
[50122,"OY","FC Physical Plant","FC","PP",50122,"3075OY",307000,300001]
[50123,"RR","FOR Research","FOR","R",50123,"2320RR",382000,300002]
[50124,"RD","FOR Research","FOR","R",50124,"2320RD",382000,300002]
[50125,"GA","FC Institutional Support","FC","IS",50125,"3061GA",306000,300001]
[50126,"GA","FC Institutional Support","FC","IS",50126,"3061GA",306000,300001]
[50127,"GA","FC Institutional Support","FC","IS",50127,"3068GA",306000,300001]
[50128,"RM","FOR Research","FOR","R",50128,"3828RM",382000,300002]
[{"$f":"IF(F1012>0,VALUE(F1012),\" \")","v":50129},{"$f":"IF(A1012<>\" \",RIGHT(G1012,2),\" \")","v":"OM"},{"$f":"IF(A1012<>\" \",VLOOKUP(H1012,ALLOC_NCHEMS,2,0),\" \")","v":"FC Institutional Support"},{"$f":"IF(A1012<>\" \",VLOOKUP(I1012,ALLOC,2,0),\" \")","v":"FC"},"PP",50129,"3064OM",306000,300001]
[50130,"OM","FC Institutional Support","FC","PP",50130,"3064OM",306000,300001]
[50131,"PS","FC Public Service","FC","PS",50131,"3038PS",303000,300001]
[50132,"OM","FC Institutional Support","FC","PP",50132,"3064OM",306000,300001]
[50133,"PS","KC Public Service","KC","PS",50133,"3430PS",343000,300004]
[50134,"RR","FOR Research","FOR","R",50134,"382BRR",382000,300002]
[50135,"AS","CC Academic Support","CC","AS",50135,"3741AS",374000,200004]
[50136,"IN","CC Instruction","CC","I",50136,"3712IN",371000,200004]
[50137,"GA","FC Institutional Support","FC","IS",50137,"3068GA",306000,300001]
[50138,"GA","FC Institutional Support","FC","IS",50138,"3068GA",306000,300001]
[50139,"AL","CC Library Services","CC","L",50139,"3743AL",374500,200004]
[50140,"GA","FC Institutional Support","FC","IS",50140,"3068GA",306000,300001]
[50141,"GA","FC Institutional Support","FC","IS",50141,"3068GA",306000,300001]
[50142,"GA","FC Institutional Support","FC","IS",50142,"3068GA",306000,300001]
[50143,"GA","FC Institutional Support","FC","IS",50143,"3069GA",306000,300001]
[50144,"GA","FC Institutional Support","FC",{"$f":"IF(A1027<>\" \",VLOOKUP(B1027,NCHEMS_ABBR,3,0),\" \")","v":"IS"},50144,"3061GA",306000,300001]
[50145,"GA","FC Institutional Support","FC","IS",50145,"3061GA",306000,300001]
[50146,"UX","FC Auxiliary Services","FC","AUX",50146,"3096UX",309000,300001]
[50147,"UX","FC Auxiliary Services","FC","AUX",50147,"3096UX",309000,300001]
[50148,"UX","FC Auxiliary Services","FC","AUX",50148,"3096UX",309000,300001]
[50149,"SS","CC Student Services","CC","SS",50149,"3751SS",375000,200004]
[50150,"AS","KC Academic Support","KC","AS",50150,"3441AS",344000,300004]
[50151,"AS","KC Academic Support","KC","AS",50151,"3441AS",344000,300004]
[50152,"AS","KC Academic Support","KC","AS",50152,"3441AS",344000,300004]
[50153,"PS","CC Public Service","CC","PS",50153,"3731PS",373000,200004]
[50154,"IN","KC Instruction","KC","I",50154,"3412IN",341000,300004]
[50155,"UX","FC Auxiliary Services","FC","AUX",50155,"3094UX",309000,300001]
[50156,"AL","KC Library Services","KC","L",50156,"3443AL",344500,300004]
[50157,"IN","FC Instruction","FC","I",50157,"3019IN",301000,300001]
[50158,"OM","KC Physical Plant","KC","PP",50158,"3472OM",347000,300004]
[50159,"GA","FOR Institutional Supt","FOR","IS",50159,"3828GA",386000,300002]
[50160,"RR","FOR Research","FOR","R",50160,"382BRR",382000,300002]
[50161,"OM","FC Physical Plant","FC","PP",50161,"3074OM",307000,300001]
[50162,"SS","KC Student Services","KC","SS",50162,"3451SS",345000,300004]
[50163,"AS","NC Academic Support","NC","AS",50163,"3541AS",354000,300005]
[50164,"IN","FC Instruction","FC","I",50164,"3017IN",301000,300001]
[50165,"AS","NC Academic Support","NC","AS",50165,"3541AS",354000,300005]
[50166,"AS","NC Academic Support","NC","AS",50166,"3541AS",354000,300005]
[50167,"GA","RC Institutional Supt","RC","IS",50167,"3217GA",326000,300006]
[50168,"GA","IC Institutional Support","IC","IS",50168,"2211GA",226000,300003]
[50169,"GA","KC Institutional Support","KC","IS",50169,"3413GA",346000,300004]
[50170,"GA","CC Institutional Support","CC","IS",50170,"3713GA",376000,200004]
[50171,"GA","NC Institutional Support","NC","IS",50171,"3512GA",356000,300005]
[50172,"IN","NC Instruction","NC","I",50172,"3512IN",351000,300005]
[50173,"AL","NC Library Services","NC","L",50173,"3543AL",354500,300005]
[50174,"OM","NC Physical Plant","NC","PP",50174,"3572OM",357000,300005]
[50175,"SS","NC Student Services","NC","SS",50175,"3540SS",355000,300005]
[50176,"NA","CTC Unallocated Authority","CTC","U",50176,"360XNA","360X00",300010]
[50177,"NA","FOR Unallocated Authority","FOR","U",50177,"380XNA","380X00",300002]
[50178,"NA","FC Unallocated Authority","FC","U",50178,"300XNA","300X00",300001]
[50179,"NA","CES Unallocated Authority","CES","U",50179,"330XNA","330X00",200001]
[50180,"NA","BBC Unallocated Authority","BBC","U",50180,"210XNA","210X00",200003]
[50181,"NA","IC Unallocated Authority","IC","U",50181,"220XNA","220X00",300003]
[50182,"NA","RC Unallocated Authority","RC","U",50182,"320XNA","320X00",300006]
[50183,"NA","KC Unallocated Authority","KC","U",50183,"340XNA","340X00",300004]
[50184,"NA","CC Unallocated Authority","CC","U",50184,"370XNA","370X00",200004]
[50185,"NA","NC Unallocated Authority","NC","U",50185,"350XNA","350X00",300005]
[50186,"GA","FC Institutional Support","FC","IS",50186,"3068GA",306000,300001]
[50187,"IN","FC Instruction","FC","I",50187,"3017IN",301000,300001]
[50188,"GA","FC Institutional Support","FC","IS",50188,"3061GA",306000,300001]
[50189,"GA","RC Institutional Supt","RC","IS",50189,"3244GA",326000,300006]
[50190,"IN","BBC Instruction","BBC","I",50190,"2110IN",211000,200003]
[50191,"GA","FC Institutional Support","FC","IS",50191,"3068GA",306000,300001]
[50192,"GA","IC Institutional Support","IC","IS",50192,"2261GA",226000,300003]
[{"$f":"IF(F1076>0,VALUE(F1076),\" \")","v":50193},{"$f":"IF(A1076<>\" \",RIGHT(G1076,2),\" \")","v":"GA"},{"$f":"IF(A1076<>\" \",VLOOKUP(H1076,ALLOC_NCHEMS,2,0),\" \")","v":"BBC Institutional Support"},{"$f":"IF(A1076<>\" \",VLOOKUP(I1076,ALLOC,2,0),\" \")","v":"BBC"},"IS",50193,"2161GA",216000,200003]
[50194,"GA","CC Institutional Support","CC","IS",50194,"3761GA",376000,200004]
[50195,"GA","CTC Institutional Support","CTC","IS",50195,"3612GA",366000,300010]
[50196,"GA","NC Institutional Support","NC","IS",50196,"3561GA",356000,300005]
[50197,"IN","FC Instruction","FC","I",50197,"3017IN",301000,300001]
[50198,"GA","CES Institutional Support","CES","IS",50198,"3331GA",336000,200001]
[50199,"IN","FC Instruction","FC","I",50199,"3017IN",301000,300001]
[50200,"FA","FC Scholarships","FC","FA",50200,"3017FA",308000,300001]
[50201,"FA","FC Scholarships","FC","FA",50201,"3017FA",308000,300001]
[50202,"FA","FC Scholarships","FC","FA",50202,"3017FA",308000,300001]
[50203,"FA","FC Scholarships","FC","FA",50203,"3017FA",308000,300001]
[50204,"FA","FC Scholarships","FC","FA",50204,"3017FA",308000,300001]
[50205,"FA","FC Scholarships","FC","FA",50205,"3017FA",308000,300001]
[50206,"FA","FC Scholarships","FC","FA",50206,"3017FA",308000,300001]
[50207,"FA","FC Scholarships","FC","FA",50207,"3017FA",308000,300001]
[50208,"FA","FC Scholarships","FC",{"$f":"IF(A1091<>\" \",VLOOKUP(B1091,NCHEMS_ABBR,3,0),\" \")","v":"FA"},50208,"3017FA",308000,300001]
[50209,"FA","FC Scholarships","FC","FA",50209,"3017FA",308000,300001]
[50210,"GM","FC Institutional Support","FC","IS",50210,"3065GM",306000,300001]
[50211,"GM","FC Institutional Support","FC","IS",50211,"3065GM",306000,300001]
[50212,"GM","FC Institutional Support","FC","IS",50212,"3065GM",306000,300001]
[50213,"UX","FC Auxiliary Services","FC","AUX",50213,"3096UX",309000,300001]
[50214,"OY","FC Physical Plant","FC","PP",50214,"3075OY",307000,300001]
[50215,"OY","FC Physical Plant","FC","PP",50215,"3075OY",307000,300001]
[50216,"OM","FC Physical Plant","FC","PP",50216,"3075OM",307000,300001]
[50217,"OM","FC Physical Plant","FC","PP",50217,"3075OM",307000,300001]
[50218,"OY","FC Physical Plant","FC","PP",50218,"3075OY",307000,300001]
[50219,"OY","FC Physical Plant","FC","PP",50219,"3075OY",307000,300001]
[50220,"OM","FC Physical Plant","FC","PP",50220,"3070OM",307000,300001]
[50221,"GA","FC Institutional Support","FC","IS",50221,"3061GA",306000,300001]
[50222,"GA","FC Institutional Support","FC","IS",50222,"3062GA",306000,300001]
[50223,"GA","FC Institutional Support","FC","IS",50223,"3061GA",306000,300001]
[50224,"GM","FC Institutional Support","FC","IS",50224,"3061GM",306000,300001]
[50225,"GM","FC Institutional Support","FC","IS",50225,"3065GM",306000,300001]
[50226,"GA","FC Institutional Support","FC","IS",50226,"3068GA",306000,300001]
[50227,"OM","FC Physical Plant","FC","PP",50227,"3074OM",307000,300001]
[50228,"GA","FC Institutional Support","FC","IS",50228,"3061GA",306000,300001]
[50229,"GA","FC Institutional Support","FC","IS",50229,"3061GA",306000,300001]
[50230,"GA","FC Institutional Support","FC","IS",50230,"3061GA",306000,300001]
[50231,"GA","FC Institutional Support","FC","IS",50231,"3061GA",306000,300001]
[50232,"GM","FC Institutional Support","FC","IS",50232,"3061GM",306000,300001]
[50233,"GA","FC Institutional Support","FC","IS",50233,"3061GA",306000,300001]
[50234,"GA","FC Institutional Support","FC","IS",50234,"3061GA",306000,300001]
[50235,"GA","FC Institutional Support","FC","IS",50235,"3061GA",306000,300001]
[50236,"SZ","FC Student Services","FC","SS",50236,"3051SZ",305000,300001]
[50237,"GA","FC Institutional Support","FC","IS",50237,"3068GA",306000,300001]
[50238,"SZ","FC Student Services","FC","SS",50238,"3051SZ",305000,300001]
[50239,"OM","FC Physical Plant","FC","PP",50239,"3070OM",307000,300001]
[50240,"OM","FC Physical Plant","FC","PP",50240,"3070OM",307000,300001]
[50241,"OM","FC Physical Plant","FC","PP",50241,"3070OM",307000,300001]
[50242,"OM","FC Physical Plant","FC","PP",50242,"3070OM",307000,300001]
[50243,"GA","FC Institutional Support","FC","IS",50243,"3061GA",306000,300001]
[50244,"PS","FC Public Service","FC","PS",50244,"3031PS",303000,300001]
[50245,"GY","FC Institutional Support","FC","IS",50245,"306AGY",306000,300001]
[50246,"GY","FC Institutional Support","FC","IS",50246,"306AGY",306000,300001]
[50247,"GY","FC Institutional Support","FC","IS",50247,"306AGY",306000,300001]
[50248,"PS","FC Public Service","FC","PS",50248,"3030PS",303000,300001]
[50249,"OM","FC Physical Plant","FC","PP",50249,"3070OM",307000,300001]
[50250,"GY","FC Institutional Support","FC","IS",50250,"3067GY",306000,300001]
[50251,"GY","FC Institutional Support","FC","IS",50251,"3067GY",306000,300001]
[50252,"GY","FC Institutional Support","FC","IS",50252,"3067GY",306000,300001]
[50253,"GY","FC Institutional Support","FC","IS",50253,"3067GY",306000,300001]
[50254,"GY","FC Institutional Support","FC","IS",50254,"306AGY",306000,300001]
[50255,"GY","FC Institutional Support","FC","IS",50255,"306AGY",306000,300001]
[50256,"GY","FC Institutional Support","FC","IS",50256,"306AGY",306000,300001]
[{"$f":"IF(F1140>0,VALUE(F1140),\" \")","v":50257},{"$f":"IF(A1140<>\" \",RIGHT(G1140,2),\" \")","v":"GY"},{"$f":"IF(A1140<>\" \",VLOOKUP(H1140,ALLOC_NCHEMS,2,0),\" \")","v":"FC Institutional Support"},{"$f":"IF(A1140<>\" \",VLOOKUP(I1140,ALLOC,2,0),\" \")","v":"FC"},"IS",50257,"306AGY",306000,300001]
[50258,"OY","FC Physical Plant","FC","PP",50258,"3070OY",307000,300001]
[50259,"OM","FC Physical Plant","FC","PP",50259,"3070OM",307000,300001]
[50260,"OY","FC Physical Plant","FC","PP",50260,"3073OY",307000,300001]
[50261,"OY","FC Physical Plant","FC","PP",50261,"3073OY",307000,300001]
[50262,"GY","FC Institutional Support","FC","IS",50262,"3067GY",306000,300001]
[50263,"GM","FC Institutional Support","FC","IS",50263,"3065GM",306000,300001]
[50264,"OM","FC Physical Plant","FC","PP",50264,"3070OM",307000,300001]
[50265,"OM","FC Physical Plant","FC","PP",50265,"3070OM",307000,300001]
[50266,"OM","FC Physical Plant","FC","PP",50266,"3070OM",307000,300001]
[50267,"OM","FC Physical Plant","FC","PP",50267,"3070OM",307000,300001]
[50268,"OM","FC Physical Plant","FC","PP",50268,"3070OM",307000,300001]
[50269,"OM","FC Physical Plant","FC","PP",50269,"3070OM",307000,300001]
[50270,"OM","FC Physical Plant","FC","PP",50270,"3070OM",307000,300001]
[50271,"OM","FC Physical Plant","FC","PP",50271,"3070OM",307000,300001]
[50272,"OY","FC Physical Plant","FC",{"$f":"IF(A1155<>\" \",VLOOKUP(B1155,NCHEMS_ABBR,3,0),\" \")","v":"PP"},50272,"3073OY",307000,300001]
[50273,"OY","FC Physical Plant","FC","PP",50273,"3073OY",307000,300001]
[50274,"OM","FC Physical Plant","FC","PP",50274,"3070OM",307000,300001]
[50275,"OM","FC Physical Plant","FC","PP",50275,"3070OM",307000,300001]
[50276,"OM","FC Physical Plant","FC","PP",50276,"3070OM",307000,300001]
[50277,"OM","FC Physical Plant","FC","PP",50277,"3070OM",307000,300001]
[50278,"OY","FC Physical Plant","FC","PP",50278,"3073OY",307000,300001]
[50279,"OM","FC Physical Plant","FC","PP",50279,"3070OM",307000,300001]
[50280,"OY","FC Physical Plant","FC","PP",50280,"3073OY",307000,300001]
[50281,"OY","FC Physical Plant","FC","PP",50281,"3073OY",307000,300001]
[50282,"OY","FC Physical Plant","FC","PP",50282,"3073OY",307000,300001]
[50283,"OY","FC Physical Plant","FC","PP",50283,"3073OY",307000,300001]
[50284,"OY","FC Physical Plant","FC","PP",50284,"3073OY",307000,300001]
[50285,"UX","FC Auxiliary Services","FC","AUX",50285,"3099UX",309000,300001]
[50286,"OM","FC Physical Plant","FC","PP",50286,"3070OM",307000,300001]
[50287,"UX","FC Auxiliary Services","FC","AUX",50287,"3096UX",309000,300001]
[50288,"UX","FC Auxiliary Services","FC","AUX",50288,"3096UX",309000,300001]
[50289,"GP","FC Institutional Support","FC","IS",50289,"3061GP",306000,300001]
[50290,"GM","FC Institutional Support","FC","IS",50290,"3068GM",306000,300001]
[50291,"OM","FC Physical Plant","FC","PP",50291,"3075OM",307000,300001]
[50293,"SS","FC Student Services","FC","SS",50293,"3069SS",305000,300001]
[50294,"OM","FC Physical Plant","FC","PP",50294,"3070OM",307000,300001]
[50295,"GA","FC Institutional Support","FC","IS",50295,"3068GA",306000,300001]
[50296,"OY","FC Physical Plant","FC","PP",50296,"3072OY",307000,300001]
[50297,"GY","FC Institutional Support","FC","IS",50297,"3067GY",306000,300001]
[50300,"SS","FC Student Services","FC","SS",50300,"3069SS",305000,300001]
[50301,"OY","FC Physical Plant","FC","PP",50301,"3075OY",307000,300001]
[50302,"OY","FC Physical Plant","FC","PP",50302,"3075OY",307000,300001]
[50303,"GA","FC Institutional Support","FC","IS",50303,"3069GA",306000,300001]
[50304,"GZ","FC Institutional Support","FC","IS",50304,"3063GZ",306000,300001]
[50305,"OM","FC Physical Plant","FC","PP",50305,"3075OM",307000,300001]
[50306,"IN","FC Instruction","FC","I",50306,"3017IN",301000,300001]
[50307,"GY","FC Institutional Support","FC","IS",50307,"306AGY",306000,300001]
[50308,"AS","BBC Academic Support","BBC","AS",50308,"2110AS",214000,200003]
[50309,"PS","BBC Public Service","BBC","PS",50309,"2130PS",213000,200003]
[50310,"SS","BBC Student Services","BBC","SS",50310,"2110SS",215000,200003]
[50311,"GA","FC Institutional Support","FC","IS",50311,"3061GA",306000,300001]
[50312,"GA","FC Institutional Support","FC","IS",50312,"3068GA",306000,300001]
[50313,"IN","FC Instruction","FC","I",50313,"3017IN",301000,300001]
[50314,"SS","FC Student Services","FC","SS",50314,"3052SS",305000,300001]
[50315,"SZ","FC Intercollegiate Athl","FC","SS",50315,"3055SZ",305500,300001]
[50316,"PS","FC Public Service","FC","PS",50316,"3030PS",303000,300001]
[50317,"AL","FC Library Services","FC","L",50317,"304BAL",304500,300001]
[50318,"OM","FC Physical Plant","FC","PP",50318,"3074OM",307000,300001]
[50319,"GA","FC Institutional Support","FC","IS",50319,"3068GA",306000,300001]
[50320,"AS","FC Academic Support","FC","AS",50320,"3048AS",304000,300001]
[50321,"RR","FOR Research","FOR","R",50321,"382BRR",382000,300002]
[50322,"GY","FC Institutional Support","FC","IS",50322,"3067GY",306000,300001]
[50323,"FA","FC Scholarships","FC","FA",50323,"3017FA",308000,300001]
[{"$f":"IF(F1204>0,VALUE(F1204),\" \")","v":50325},{"$f":"IF(A1204<>\" \",RIGHT(G1204,2),\" \")","v":"OY"},{"$f":"IF(A1204<>\" \",VLOOKUP(H1204,ALLOC_NCHEMS,2,0),\" \")","v":"FC Physical Plant"},{"$f":"IF(A1204<>\" \",VLOOKUP(I1204,ALLOC,2,0),\" \")","v":"FC"},"PP",50325,"3072OY",307000,300001]
[50326,"OY","FC Physical Plant","FC","PP",50326,"3070OY",307000,300001]
[50327,"IN","FC Instruction","FC","I",50327,"3017IN",301000,300001]
[50328,"OM","FC Physical Plant","FC","PP",50328,"3070OM",307000,300001]
[50329,"GA","FC Institutional Support","FC","IS",50329,"3061GA",306000,300001]
[50330,"OM","FC Physical Plant","FC","PP",50330,"3070OM",307000,300001]
[50331,"OM","FC Physical Plant","FC","PP",50331,"3070OM",307000,300001]
[50332,"OM","FC Physical Plant","FC","PP",50332,"3070OM",307000,300001]
[50333,"UX","FC Auxiliary Services","FC","AUX",50333,"3096UX",309000,300001]
[50334,"OM","FC Physical Plant","FC","PP",50334,"3070OM",307000,300001]
[50335,"OM","FC Physical Plant","FC","PP",50335,"3070OM",307000,300001]
[50336,"OM","FC Physical Plant","FC","PP",50336,"3070OM",307000,300001]
[50337,"OM","FC Physical Plant","FC","PP",50337,"3070OM",307000,300001]
[50338,"OM","FC Physical Plant","FC","PP",50338,"3070OM",307000,300001]
[50339,"OM","FC Physical Plant","FC","PP",50339,"3070OM",307000,300001]
[50340,"OM","FC Physical Plant","FC",{"$f":"IF(A1219<>\" \",VLOOKUP(B1219,NCHEMS_ABBR,3,0),\" \")","v":"PP"},50340,"3070OM",307000,300001]
[50341,"OM","FC Physical Plant","FC","PP",50341,"3070OM",307000,300001]
[50342,"OM","FC Physical Plant","FC","PP",50342,"3070OM",307000,300001]
[50343,"OM","FC Physical Plant","FC","PP",50343,"3070OM",307000,300001]
[50344,"OM","FC Physical Plant","FC","PP",50344,"3070OM",307000,300001]
[50345,"GA","FC Institutional Support","FC","IS",50345,"3068GA",306000,300001]
[50346,"OM","FC Physical Plant","FC","PP",50346,"3070OM",307000,300001]
[50347,"OM","FC Physical Plant","FC","PP",50347,"3070OM",307000,300001]
[50348,"OM","FC Physical Plant","FC","PP",50348,"3070OM",307000,300001]
[50349,"OM","FC Physical Plant","FC","PP",50349,"3070OM",307000,300001]
[50350,"OM","FC Physical Plant","FC","PP",50350,"3070OM",307000,300001]
[50351,"OM","FC Physical Plant","FC","PP",50351,"3070OM",307000,300001]
[50352,"OM","FC Physical Plant","FC","PP",50352,"3070OM",307000,300001]
[50353,"GA","FC Institutional Support","FC","IS",50353,"3068GA",306000,300001]
[50354,"IN","FC Instruction","FC","I",50354,"3017IN",301000,300001]
[50355,"GA","FC Institutional Support","FC","IS",50355,"3068GA",306000,300001]
[50356,"OM","FC Physical Plant","FC","PP",50356,"3070OM",307000,300001]
[50357,"OM","FC Physical Plant","FC","PP",50357,"3070OM",307000,300001]
[50358,"OM","FC Physical Plant","FC","PP",50358,"3070OM",307000,300001]
[50359,"OM","FC Physical Plant","FC","PP",50359,"3070OM",307000,300001]
[50360,"UX","FC Auxiliary Services","FC","AUX",50360,"309CUX",309000,300001]
[50361,"UX","FC Auxiliary Services","FC","AUX",50361,"309CUX",309000,300001]
[50362,"UX","FC Auxiliary Services","FC","AUX",50362,"309CUX",309000,300001]
[50363,"UX","FC Auxiliary Services","FC","AUX",50363,"309CUX",309000,300001]
[50364,"OM","FC Physical Plant","FC","PP",50364,"3070OM",307000,300001]
[50365,"UM","FC Auxiliary Services","FC","AUX",50365,"309CUM",309000,300001]
[50366,"OM","FC Physical Plant","FC","PP",50366,"3070OM",307000,300001]
[50367,"OM","FC Physical Plant","FC","PP",50367,"3070OM",307000,300001]
[50368,"OM","FC Physical Plant","FC","PP",50368,"3070OM",307000,300001]
[50369,"OM","FC Physical Plant","FC","PP",50369,"3070OM",307000,300001]
[50370,"OM","FC Physical Plant","FC","PP",50370,"3070OM",307000,300001]
[50371,"OM","FC Physical Plant","FC","PP",50371,"3070OM",307000,300001]
[50372,"OM","FC Physical Plant","FC","PP",50372,"3070OM",307000,300001]
[50375,"OM","FC Physical Plant","FC","PP",50375,"3070OM",307000,300001]
[50377,"OM","FC Physical Plant","FC","PP",50377,"3070OM",307000,300001]
[50399,"OM","FC Physical Plant","FC","PP",50399,"3070OM",307000,300001]
[50400,"OM","FC Physical Plant","FC","PP",50400,"3070OM",307000,300001]
[50401,"OM","FC Physical Plant","FC","PP",50401,"3070OM",307000,300001]
[50402,"OM","FC Physical Plant","FC","PP",50402,"3070OM",307000,300001]
[50403,"OM","FC Physical Plant","FC","PP",50403,"3070OM",307000,300001]
[50404,"OM","FC Physical Plant","FC","PP",50404,"3070OM",307000,300001]
[50405,"OM","FC Physical Plant","FC","PP",50405,"3072OM",307000,300001]
[50406,"OM","FC Physical Plant","FC","PP",50406,"3070OM",307000,300001]
[50407,"OY","FC Physical Plant","FC","PP",50407,"3070OY",307000,300001]
[50408,"OY","FC Physical Plant","FC","PP",50408,"3070OY",307000,300001]
[50409,"OY","FC Physical Plant","FC","PP",50409,"3070OY",307000,300001]
[50410,"OY","FC Physical Plant","FC","PP",50410,"3070OY",307000,300001]
[50411,"OY","FC Physical Plant","FC","PP",50411,"3070OY",307000,300001]
[50412,"OY","FC Physical Plant","FC","PP",50412,"3070OY",307000,300001]
[{"$f":"IF(F1268>0,VALUE(F1268),\" \")","v":50413},{"$f":"IF(A1268<>\" \",RIGHT(G1268,2),\" \")","v":"OY"},{"$f":"IF(A1268<>\" \",VLOOKUP(H1268,ALLOC_NCHEMS,2,0),\" \")","v":"FC Physical Plant"},{"$f":"IF(A1268<>\" \",VLOOKUP(I1268,ALLOC,2,0),\" \")","v":"FC"},"PP",50413,"3070OY",307000,300001]
[50414,"OY","FC Physical Plant","FC","PP",50414,"3070OY",307000,300001]
[50415,"OY","FC Physical Plant","FC","PP",50415,"3073OY",307000,300001]
[50416,"OM","FC Physical Plant","FC","PP",50416,"3072OM",307000,300001]
[50417,"GA","FC Institutional Support","FC","IS",50417,"3061GA",306000,300001]
[50420,"GM","FC Institutional Support","FC","IS",50420,"3061GM",306000,300001]
[50421,"GM","FC Institutional Support","FC","IS",50421,"3061GM",306000,300001]
[50422,"GM","FC Institutional Support","FC","IS",50422,"3061GM",306000,300001]
[50423,"GM","FC Institutional Support","FC","IS",50423,"3061GM",306000,300001]
[50424,"GZ","FC Institutional Support","FC","IS",50424,"3061GZ",306000,300001]
[50425,"GM","FC Institutional Support","FC","IS",50425,"3061GM",306000,300001]
[50426,"GM","FC Institutional Support","FC","IS",50426,"3061GM",306000,300001]
[50527,"GA","FC Institutional Support","FC","IS",50527,"3061GA",306000,300001]
[50528,"GA","FC Institutional Support","FC","IS",50528,"3061GA",306000,300001]
[50529,"GA","FC Institutional Support","FC","IS",50529,"3061GA",306000,300001]
[50530,"GA","FC Institutional Support","FC",{"$f":"IF(A1283<>\" \",VLOOKUP(B1283,NCHEMS_ABBR,3,0),\" \")","v":"IS"},50530,"3061GA",306000,300001]
[50531,"GA","FC Institutional Support","FC","IS",50531,"3061GA",306000,300001]
[50532,"GA","FC Institutional Support","FC","IS",50532,"3061GA",306000,300001]
[50533,"GA","FC Institutional Support","FC","IS",50533,"3061GA",306000,300001]
[50701,"OM","FC Physical Plant","FC","PP",50701,"3070OM",307000,300001]
[50702,"IN","FC Instruction","FC","I",50702,"3010IN",301000,300001]
[50703,"IN","FC Instruction","FC","I",50703,"3016IN",301000,300001]
[50704,"IN","FC Instruction","FC","I",50704,"3012IN",301000,300001]
[50705,"IN","FC Instruction","FC","I",50705,"3017IN",301000,300001]
[50706,"IN","FC Instruction","FC","I",50706,"3013IN",301000,300001]
[50707,"IN","FC Instruction","FC","I",50707,"3011IN",301000,300001]
[50708,"IN","FC Instruction","FC","I",50708,"3014IN",301000,300001]
[50709,"IN","FC Instruction","FC","I",50709,"3010IN",301000,300001]
[50710,"IN","FC Instruction","FC","I",50710,"3016IN",301000,300001]
[50711,"IN","FC Instruction","FC","I",50711,"3012IN",301000,300001]
[50712,"IN","FC Instruction","FC","I",50712,"301DIN",301000,300001]
[50713,"IN","FC Instruction","FC","I",50713,"3013IN",301000,300001]
[50714,"IN","FC Instruction","FC","I",50714,"3011IN",301000,300001]
[50715,"IN","FC Instruction","FC","I",50715,"3014IN",301000,300001]
[50716,"IN","FC Instruction","FC","I",50716,"3017IN",301000,300001]
[50717,"IN","FC Instruction","FC","I",50717,"301DIN",301000,300001]
[50718,"IN","FC Instruction","FC","I",50718,"3014IN",301000,300001]
[50719,"IN","FC Instruction","FC","I",50719,"3014IN",301000,300001]
[50720,"IN","FC Instruction","FC","I",50720,"3014IN",301000,300001]
[50721,"IN","FC Instruction","FC","I",50721,"3014IN",301000,300001]
[51000,"UX","FC Auxiliary Services","FC","AUX",51000,"309DUX",309000,300001]
[51001,"GA","FC Institutional Support","FC","IS",51001,"3069GA",306000,300001]
[51002,"RD","FOR Research","FOR","R",51002,"2320RD",382000,300002]
[51003,"GY","FC Institutional Support","FC","IS",51003,"3061GY",306000,300001]
[51004,"GY","FC Institutional Support","FC","IS",51004,"3061GY",306000,300001]
[51005,"OM","FC Physical Plant","FC","PP",51005,"3075OM",307000,300001]
[51006,"GA","FC Institutional Support","FC","IS",51006,"3068GA",306000,300001]
[51007,"GA","FC Institutional Support","FC","IS",51007,"3068GA",306000,300001]
[51100,"SS","RC Student Services","RC","SS",51100,"3251SS",325000,300006]
[51101,"AS","RC Academic Support","RC","AS",51101,"3245AS",324000,300006]
[51102,"AS","RC Academic Support","RC","AS",51102,"3245AS",324000,300006]
[51103,"IN","RC Instruction","RC","I",51103,"3210IN",321000,300006]
[51104,"AS","IC Academic Support","IC","AS",51104,"2210AS",224000,300003]
[51105,"IN","IC Instruction","IC","I",51105,"2210IN",221000,300003]
[51106,"SS","IC Student Services","IC","SS",51106,"2210SS",225000,300003]
[51107,"AS","CTC Academic Support","CTC","AS",51107,"3640AS",364000,300010]
[51108,"IN","CTC Instruction","CTC","I",51108,"3610IN",361000,300010]
[51109,"SS","CTC Student Services","CTC","SS",51109,"3650SS",365000,300010]
[51110,"OM","RC Physical Plant","RC","PP",51110,"3272OM",327000,300006]
[51150,"IN","FC Instruction","FC","I",51150,"3017IN",301000,300001]
[51151,"FA","FC Scholarships","FC","FA",51151,"3083FA",308000,300001]
[51152,"UX","FC Auxiliary Services","FC","AUX",51152,"3096UX",309000,300001]
[51153,"IN","BBC Instruction","BBC","I",51153,"2110IN",211000,200003]
[51154,"FA","BBC Scholarships","BBC","FA",51154,"2180FA",218000,200003]
[{"$f":"IF(F1332>0,VALUE(F1332),\" \")","v":51155},{"$f":"IF(A1332<>\" \",RIGHT(G1332,2),\" \")","v":"IN"},{"$f":"IF(A1332<>\" \",VLOOKUP(H1332,ALLOC_NCHEMS,2,0),\" \")","v":"CC Instruction"},{"$f":"IF(A1332<>\" \",VLOOKUP(I1332,ALLOC,2,0),\" \")","v":"CC"},"I",51155,"3712IN",371000,200004]
[51156,"FA","CC Scholarships","CC","FA",51156,"3780FA",378000,200004]
[51157,"IN","IC Instruction","IC","I",51157,"2210IN",221000,300003]
[51158,"FA","IC Scholarships","IC","FA",51158,"2280FA",228000,300003]
[51159,"IN","KC Instruction","KC","I",51159,"3412IN",341000,300004]
[51160,"FA","KC Scholarships","KC","FA",51160,"3480FA",348000,300004]
[51161,"UX","KC Auxiliary Services","KC","AUX",51161,"3491UX",349000,300004]
[51162,"IN","NC Instruction","NC","I",51162,"3512IN",351000,300005]
[51163,"FA","NC Scholarships","NC","FA",51163,"3580FA",358000,300005]
[51164,"IN","RC Instruction","RC","I",51164,"3210IN",321000,300006]
[51165,"FA","RC Student Loans & Schol","RC","FA",51165,"3283FA",328000,300006]
[51166,"IN","CTC Instruction","CTC","I",51166,"3610IN",361000,300010]
[51167,"FA","CTC Scholarships","CTC","FA",51167,"3680FA",368000,300010]
[51168,"UX","RC Auxiliary Service","RC","AUX",51168,"3293UX",329000,300006]
[51180,"FA","FC Scholarships","FC","FA",51180,"3083FA",308000,300001]
[51181,"FA","FC Scholarships","FC",{"$f":"IF(A1347<>\" \",VLOOKUP(B1347,NCHEMS_ABBR,3,0),\" \")","v":"FA"},51181,"3083FA",308000,300001]
[51200,"AS","BBC Academic Support","BBC","AS",51200,"2110AS",214000,200003]
[51201,"AS","CC Academic Support","CC","AS",51201,"3741AS",374000,200004]
[51202,"AS","IC Academic Support","IC","AS",51202,"2210AS",224000,300003]
[51203,"AS","KC Academic Support","KC","AS",51203,"3441AS",344000,300004]
[51204,"AS","NC Academic Support","NC","AS",51204,"3541AS",354000,300005]
[51205,"AS","RC Academic Support","RC","AS",51205,"3245AS",324000,300006]
[51206,"AS","CTC Academic Support","CTC","AS",51206,"3640AS",364000,300010]
[51207,"PS","CES Public Services","CES","PS",51207,"3331PS",333000,200001]
[51208,"GA","FC Institutional Support","FC","IS",51208,"3068GA",306000,300001]
[51209,"RR","FOR Research","FOR","R",51209,"382BRR",382000,300002]
[51300,"RR","FOR Research","FOR","R",51300,"382BRR",382000,300002]
[51301,"RR","FOR Research","FOR","R",51301,"382BRR",382000,300002]
[51500,"GA","FC Institutional Support","FC","IS",51500,"3067GA",306000,300001]
[51501,"GA","FC Institutional Support","FC","IS",51501,"3067GA",306000,300001]
[51502,"GA","FC Institutional Support","FC","IS",51502,"3061GA",306000,300001]
[51503,"GA","FC Institutional Support","FC","IS",51503,"3061GA",306000,300001]
[51504,"GA","FC Institutional Support","FC","IS",51504,"3061GA",306000,300001]
[51505,"GA","FC Institutional Support","FC","IS",51505,"3061GA",306000,300001]
[52001,"PS","CES Public Services","CES","PS",52001,"3331PS",333000,200001]
[52002,"RR","FOR Research","FOR","R",52002,"382BRR",382000,300002]
[52003,"IN","FC Instruction","FC","I",52003,"3017IN",301000,300001]
[52004,"PS","FC Public Service","FC","PS",52004,"3030PS",303000,300001]
[52005,"AS","FC Academic Support","FC","AS",52005,"3048AS",304000,300001]
[52006,"OM","FC Physical Plant","FC","PP",52006,"3074OM",307000,300001]
[52007,"GA","FC Institutional Support","FC","IS",52007,"3068GA",306000,300001]
[52008,"IN","CTC Instruction","CTC","I",52008,"3612IN",361000,300010]
[52009,"IN","KC Instruction","KC","I",52009,"3413IN",341000,300004]
[52010,"IN","NC Instruction","NC","I",52010,"3512IN",351000,300005]
[52011,"GA","FC Institutional Support","FC","IS",52011,"3068GA",306000,300001]
[52012,"AS","CTC Academic Support","CTC","AS",52012,"3640AS",364000,300010]
[52013,"GA","CC Institutional Support","CC","IS",52013,"3760GA",376000,200004]
[52014,"IN","CC Instruction","CC","I",52014,"3711IN",371000,200004]
[52015,"AL","FC Library Services","FC","L",52015,"304AAL",304500,300001]
[52016,"IN","IC Instruction","IC","I",52016,"2210IN",221000,300003]
[52017,"SS","FC Student Services","FC","SS",52017,"3050SS",305000,300001]
[52018,"IN","RC Instruction","RC","I",52018,"3213IN",321000,300006]
[52019,"AS","NC Academic Support","NC","AS",52019,"3560AS",354000,300005]
[52020,"PS","CES Public Services","CES","PS",52020,"3331PS",333000,200001]
[52021,"RR","FOR Research","FOR","R",52021,"382BRR",382000,300002]
[52022,"IN","FC Instruction","FC","I",52022,"3017IN",301000,300001]
[52023,"PS","FC Public Service","FC","PS",52023,"3030PS",303000,300001]
[52024,"AS","FC Academic Support","FC","AS",52024,"3048AS",304000,300001]
[52025,"OM","FC Physical Plant","FC","PP",52025,"3074OM",307000,300001]
[52026,"GA","FC Institutional Support","FC","IS",52026,"3068GA",306000,300001]
[52027,"IN","CTC Instruction","CTC","I",52027,"3612IN",361000,300010]
[52028,"AS","CTC Academic Support","CTC","AS",52028,"3640AS",364000,300010]
[52029,"IN","KC Instruction","KC","I",52029,"3413IN",341000,300004]
[52030,"GA","KC Institutional Support","KC","IS",52030,"3461GA",346000,300004]
[{"$f":"IF(F1396>0,VALUE(F1396),\" \")","v":52031},{"$f":"IF(A1396<>\" \",RIGHT(G1396,2),\" \")","v":"IN"},{"$f":"IF(A1396<>\" \",VLOOKUP(H1396,ALLOC_NCHEMS,2,0),\" \")","v":"NC Instruction"},{"$f":"IF(A1396<>\" \",VLOOKUP(I1396,ALLOC,2,0),\" \")","v":"NC"},"I",52031,"3512IN",351000,300005]
[52032,"GA","NC Institutional Support","NC","IS",52032,"3561GA",356000,300005]
[52033,"IN","CC Instruction","CC","I",52033,"3711IN",371000,200004]
[52034,"GA","CC Institutional Support","CC","IS",52034,"3760GA",376000,200004]
[52035,"AL","FC Library Services","FC","L",52035,"304AAL",304500,300001]
[52036,"IN","IC Instruction","IC","I",52036,"2210IN",221000,300003]
[52037,"GA","IC Institutional Support","IC","IS",52037,"2260GA",226000,300003]
[52038,"IN","BBC Instruction","BBC","I",52038,"2110IN",211000,200003]
[52039,"GA","BBC Institutional Support","BBC","IS",52039,"2160GA",216000,200003]
[52040,"SS","FC Student Services","FC","SS",52040,"3052SS",305000,300001]
[52041,"IN","RC Instruction","RC","I",52041,"3217IN",321000,300006]
[52042,"GA","RC Institutional Supt","RC","IS",52042,"3263GA",326000,300006]
[52043,"OM","FC Institutional Support","FC","PP",52043,"3064OM",306000,300001]
[52044,"OM","FC Institutional Support","FC","PP",52044,"3064OM",306000,300001]
[52045,"PS","FC Public Service","FC","PS",52045,"3038PS",303000,300001]
[52046,"PS","FC Public Service","FC",{"$f":"IF(A1411<>\" \",VLOOKUP(B1411,NCHEMS_ABBR,3,0),\" \")","v":"PS"},52046,"3038PS",303000,300001]
[52047,"PS","FC Public Service","FC","PS",52047,"3038PS",303000,300001]
[52048,"PS","FC Public Service","FC","PS",52048,"3038PS",303000,300001]
[52049,"PS","FC Public Service","FC","PS",52049,"3038PS",303000,300001]
[53000,"GA","FC Institutional Support","FC","IS",53000,"3068GA",306000,300001]
[53001,"GA","FC Institutional Support","FC","IS",53001,"3068GA",306000,300001]
[53002,"GA","FC Institutional Support","FC","IS",53002,"3061GA",306000,300001]
[53003,"IN","FC Instruction","FC","I",53003,"3017IN",301000,300001]
[53004,"GA","FC Institutional Support","FC","IS",53004,"3068GA",306000,300001]
[53005,"GA","FC Institutional Support","FC","IS",53005,"3068GA",306000,300001]
[53006,"GA","FC Institutional Support","FC","IS",53006,"3068GA",306000,300001]
[53007,"IN","FC Instruction","FC","I",53007,"3011IN",301000,300001]
[53008,"IN","FC Instruction","FC","I",53008,"3014IN",301000,300001]
[53009,"RD","FOR Research","FOR","R",53009,"3828RD",382000,300002]
[53010,"SS","FC Student Services","FC","SS",53010,"3053SS",305000,300001]
[53011,"SS","FC Student Services","FC","SS",53011,"3062SS",305000,300001]
[53012,"SS","FC Student Services","FC","SS",53012,"3062SS",305000,300001]
[53013,"IN","RC Instruction","RC","I",53013,"3213IN",321000,300006]
[53014,"AS","FC Academic Support","FC","AS",53014,"3043AS",304000,300001]
[53015,"SS","FC Student Services","FC","SS",53015,"3050SS",305000,300001]
[53016,"RR","FOR Research","FOR","R",53016,"3821RR",382000,300002]
[53017,"SS","FC Student Services","FC","SS",53017,"3050SS",305000,300001]
[53018,"GA","FC Institutional Support","FC","IS",53018,"3061GA",306000,300001]
[53019,"GA","FC Institutional Support","FC","IS",53019,"3061GA",306000,300001]
[53020,"GM","FC Institutional Support","FC","IS",53020,"3068GM",306000,300001]
[53021,"GM","FC Institutional Support","FC","IS",53021,"3061GM",306000,300001]
[53022,"GA","FC Institutional Support","FC","IS",53022,"3061GA",306000,300001]
[53023,"GP","FC Institutional Support","FC","IS",53023,"3061GP",306000,300001]
[53024,"AS","FC Academic Support","FC","AS",53024,"304AAS",304000,300001]
[53025,"IN","FC Instruction","FC","I",53025,"3010IN",301000,300001]
[53026,"AS","FC Academic Support","FC","AS",53026,"304AAS",304000,300001]
[53027,"IN","KC Instruction","KC","I",53027,"3411IN",341000,300004]
[53028,"SS","FC Student Services","FC","SS",53028,"3050SS",305000,300001]
[53029,"SS","FC Student Services","FC","SS",53029,"3062SS",305000,300001]
[53030,"ID","FC Instruction","FC","I",53030,"3015ID",301000,300001]
[53031,"SZ","FC Student Services","FC","SS",53031,"3050SZ",305000,300001]
[53032,"IN","CTC Instruction","CTC","I",53032,"3610IN",361000,300010]
[53033,"IN","FC Instruction","FC","I",53033,"3014IN",301000,300001]
[53034,"IN","IC Instruction","IC","I",53034,"2210IN",221000,300003]
[53035,"PD","CES Public Services","CES","PS",53035,"3330PD",333000,200001]
[53036,"IN","FC Instruction","FC","I",53036,"3016IN",301000,300001]
[53037,"IN","FC Instruction","FC","I",53037,"3016IN",301000,300001]
[53038,"IN","FC Instruction","FC","I",53038,"3016IN",301000,300001]
[53039,"IN","FC Instruction","FC","I",53039,"3016IN",301000,300001]
[53040,"IN","FC Instruction","FC","I",53040,"3016IN",301000,300001]
[53041,"SZ","FC Student Services","FC","SS",53041,"3050SZ",305000,300001]
[53042,"SS","FC Student Services","FC","SS",53042,"3050SS",305000,300001]
[53043,"SS","FC Student Services","FC","SS",53043,"3050SS",305000,300001]
[53044,"SS","FC Student Services","FC","SS",53044,"3050SS",305000,300001]
[{"$f":"IF(F1460>0,VALUE(F1460),\" \")","v":53045},{"$f":"IF(A1460<>\" \",RIGHT(G1460,2),\" \")","v":"SS"},{"$f":"IF(A1460<>\" \",VLOOKUP(H1460,ALLOC_NCHEMS,2,0),\" \")","v":"FC Student Services"},{"$f":"IF(A1460<>\" \",VLOOKUP(I1460,ALLOC,2,0),\" \")","v":"FC"},"SS",53045,"3050SS",305000,300001]
[53046,"SS","FC Student Services","FC","SS",53046,"3050SS",305000,300001]
[53047,"IN","FC Instruction","FC","I",53047,"3010IN",301000,300001]
[53048,"IN","FC Instruction","FC","I",53048,"3010IN",301000,300001]
[53049,"SS","FC Student Services","FC","SS",53049,"3050SS",305000,300001]
[53050,"SS","FC Student Services","FC","SS",53050,"3053SS",305000,300001]
[53051,"SS","FC Student Services","FC","SS",53051,"3050SS",305000,300001]
[53052,"SS","FC Student Services","FC","SS",53052,"3062SS",305000,300001]
[53053,"IN","FC Instruction","FC","I",53053,"3016IN",301000,300001]
[53054,"IN","FC Instruction","FC","I",53054,"3016IN",301000,300001]
[53055,"IN","FC Instruction","FC","I",53055,"3016IN",301000,300001]
[53056,"RR","FOR Research","FOR","R",53056,"3823RR",382000,300002]
[53057,"RR","FOR Research","FOR","R",53057,"3823RR",382000,300002]
[53058,"RR","FOR Research","FOR","R",53058,"3823RR",382000,300002]
[53059,"SS","FC Student Services","FC","SS",53059,"3053SS",305000,300001]
[53060,"SS","FC Student Services","FC",{"$f":"IF(A1475<>\" \",VLOOKUP(B1475,NCHEMS_ABBR,3,0),\" \")","v":"SS"},53060,"3050SS",305000,300001]
[53061,"AS","FC Academic Support","FC","AS",53061,"304AAS",304000,300001]
[53062,"GP","FC Institutional Support","FC","IS",53062,"3043GP",306000,300001]
[53063,"AS","FC Academic Support","FC","AS",53063,"3043AS",304000,300001]
[53064,"IN","FC Instruction","FC","I",53064,"3013IN",301000,300001]
[53065,"GZ","FC Institutional Support","FC","IS",53065,"3063GZ",306000,300001]
[53066,"OM","FC Physical Plant","FC","PP",53066,"3070OM",307000,300001]
[53067,"SZ","FC Student Services","FC","SS",53067,"3050SZ",305000,300001]
[53068,"GA","FC Institutional Support","FC","IS",53068,"3068GA",306000,300001]
[53069,"PS","FC Public Service","FC","PS",53069,"3033PS",303000,300001]
[53070,"RR","FOR Research","FOR","R",53070,"3828RR",382000,300002]
[53071,"GA","FC Institutional Support","FC","IS",53071,"3062GA",306000,300001]
[53072,"RR","FOR Research","FOR","R",53072,"3828RR",382000,300002]
[53073,"IN","FC Instruction","FC","I",53073,"3016IN",301000,300001]
[53074,"ID","FC Instruction","FC","I",53074,"3013ID",301000,300001]
[53075,"AC","FC Academic Support","FC","AS",53075,"304DAC",304000,300001]
[53076,"AC","FC Academic Support","FC","AS",53076,"304DAC",304000,300001]
[53077,"AC","FC Academic Support","FC","AS",53077,"304DAC",304000,300001]
[53078,"AC","FC Academic Support","FC","AS",53078,"304DAC",304000,300001]
[53079,"AC","FC Academic Support","FC","AS",53079,"304FAC",304000,300001]
[53080,"SS","FC Student Services","FC","SS",53080,"3053SS",305000,300001]
[53081,"GA","FC Institutional Support","FC","IS",53081,"3068GA",306000,300001]
[53082,"GA","FC Institutional Support","FC","IS",53082,"3068GA",306000,300001]
[53083,"GA","FC Institutional Support","FC","IS",53083,"3068GA",306000,300001]
[53084,"AS","KC Academic Support","KC","AS",53084,"3440AS",344000,300004]
[53086,"GA","FC Institutional Support","FC","IS",53086,"3062GA",306000,300001]
[53087,"RD","FOR Research","FOR","R",53087,"3828RD",382000,300002]
[53088,"ID","FC Instruction","FC","I",53088,"3014ID",301000,300001]
[53089,"IR","FC Instruction","FC","I",53089,"3014IR",301000,300001]
[53090,"IN","FC Instruction","FC","I",53090,"3011IN",301000,300001]
[53091,"GA","FC Institutional Support","FC","IS",53091,"3068GA",306000,300001]
[53092,"RD","FOR Research","FOR","R",53092,"3828RD",382000,300002]
[53093,"SS","FC Student Services","FC","SS",53093,"3062SS",305000,300001]
[53094,"SS","FC Student Services","FC","SS",53094,"3050SS",305000,300001]
[53095,"RD","FOR Research","FOR","R",53095,"382RRD",382000,300002]
[53096,"RR","FOR Research","FOR","R",53096,"382RRR",382000,300002]
[53097,"PS","FOR Public Service","FOR","PS",53097,"3828PS",383000,300002]
[53098,"GA","FC Institutional Support","FC","IS",53098,"3068GA",306000,300001]
[53099,"GA","RC Institutional Supt","RC","IS",53099,"3244GA",326000,300006]
[53100,"GA","FC Institutional Support","FC","IS",53100,"3068GA",306000,300001]
[53101,"GA","FC Institutional Support","FC","IS",53101,"3061GA",306000,300001]
[53501,"ID","RC Instruction","RC","I",53501,"3213ID",321000,300006]
[53502,"SS","FC Student Services","FC","SS",53502,"3050SS",305000,300001]
[53504,"IN","FC Instruction","FC","I",53504,"3013IN",301000,300001]
[59050,"UX","FC Auxiliary Services","FC","AUX",59050,"309AUX",309000,300001]
[59102,"IN","FC Instruction","FC","I",59102,"3017IN",301000,300001]
[59103,"IN","FC Instruction","FC","I",59103,"3017IN",301000,300001]
[59104,"IN","FC Instruction","FC","I",59104,"3017IN",301000,300001]
[59105,"IN","FC Instruction","FC","I",59105,"3017IN",301000,300001]
[{"$f":"IF(F1524>0,VALUE(F1524),\" \")","v":59106},{"$f":"IF(A1524<>\" \",RIGHT(G1524,2),\" \")","v":"IN"},{"$f":"IF(A1524<>\" \",VLOOKUP(H1524,ALLOC_NCHEMS,2,0),\" \")","v":"FC Instruction"},{"$f":"IF(A1524<>\" \",VLOOKUP(I1524,ALLOC,2,0),\" \")","v":"FC"},"I",59106,"3017IN",301000,300001]
[59107,"IN","FC Instruction","FC","I",59107,"3017IN",301000,300001]
[59108,"IN","FC Instruction","FC","I",59108,"3017IN",301000,300001]
[59109,"IN","FC Instruction","FC","I",59109,"3017IN",301000,300001]
[59110,"IN","FC Instruction","FC","I",59110,"3017IN",301000,300001]
[59111,"IN","FC Instruction","FC","I",59111,"3017IN",301000,300001]
[59112,"AS","FC Academic Support","FC","AS",59112,"3017AS",304000,300001]
[59113,"AS","FC Academic Support","FC","AS",59113,"3017AS",304000,300001]
[59114,"SS","FC Student Services","FC","SS",59114,"3017SS",305000,300001]
[59115,"RO","FC Research","FC","R",59115,"3017RO",302000,300001]
[59116,"IN","FC Instruction","FC","I",59116,"3017IN",301000,300001]
[59200,"IN","FC Instruction","FC","I",59200,"3017IN",301000,300001]
[59201,"AL","FC Library Services","FC","L",59201,"304AAL",304500,300001]
[59202,"IN","FC Instruction","FC","I",59202,"3016IN",301000,300001]
[59203,"IN","FC Instruction","FC","I",59203,"3013IN",301000,300001]
[59204,"IN","FC Instruction","FC",{"$f":"IF(A1539<>\" \",VLOOKUP(B1539,NCHEMS_ABBR,3,0),\" \")","v":"I"},59204,"3016IN",301000,300001]
[59205,"IN","FOR Instruction","FOR","I",59205,"3820IN",381000,300002]
[59206,"SZ","FC Student Services","FC","SS",59206,"3051SZ",305000,300001]
[59207,"IN","FC Instruction","FC","I",59207,"3013IN",301000,300001]
[59208,"IN","FC Instruction","FC","I",59208,"3010IN",301000,300001]
[59209,"IN","FC Instruction","FC","I",59209,"3010IN",301000,300001]
[59210,"IN","FC Instruction","FC","I",59210,"3010IN",301000,300001]
[59211,"IN","FC Instruction","FC","I",59211,"3016IN",301000,300001]
[59212,"IN","FC Instruction","FC","I",59212,"3010IN",301000,300001]
[59213,"IN","FC Instruction","FC","I",59213,"3010IN",301000,300001]
[59214,"IN","FC Instruction","FC","I",59214,"3010IN",301000,300001]
[59215,"IN","FC Instruction","FC","I",59215,"3010IN",301000,300001]
[59216,"IN","FOR Instruction","FOR","I",59216,"3823IN",381000,300002]
[59217,"IN","FC Instruction","FC","I",59217,"3016IN",301000,300001]
[59218,"IN","FC Instruction","FC","I",59218,"3010IN",301000,300001]
[59219,"AL","FC Library Services","FC","L",59219,"304AAL",304500,300001]
[59220,"IN","FC Instruction","FC","I",59220,"3016IN",301000,300001]
[59221,"IN","FC Instruction","FC","I",59221,"3010IN",301000,300001]
[59222,"IN","FC Instruction","FC","I",59222,"3010IN",301000,300001]
[592223,"IN","FC Instruction","FC","I",592223,"3017IN",301000,300001]
[59223,"IN","FC Instruction","FC","I",59223,"3016IN",301000,300001]
[59224,"IN","FC Instruction","FC","I",59224,"3010IN",301000,300001]
[59225,"IN","FC Instruction","FC","I",59225,"3011IN",301000,300001]
[59226,"IN","FC Instruction","FC","I",59226,"3016IN",301000,300001]
[59227,"IN","FC Instruction","FC","I",59227,"3010IN",301000,300001]
[59228,"IR","FC Instruction","FC","I",59228,"3016IR",301000,300001]
[59229,"IN","FC Instruction","FC","I",59229,"3010IN",301000,300001]
[59230,"IN","FC Instruction","FC","I",59230,"3013IN",301000,300001]
[59231,"IN","FC Instruction","FC","I",59231,"3010IN",301000,300001]
[59232,"AM","FC Academic Support","FC","AS",59232,"3040AM",304000,300001]
[59233,"SZ","FC Student Services","FC","SS",59233,"3050SZ",305000,300001]
[59234,"AL","FC Library Services","FC","L",59234,"304AAL",304500,300001]
[59235,"SZ","FC Student Services","FC","SS",59235,"3050SZ",305000,300001]
[59236,"IN","FC Instruction","FC","I",59236,"3013IN",301000,300001]
[59237,"IN","FC Instruction","FC","I",59237,"3016IN",301000,300001]
[59238,"RR","FOR Research","FOR","R",59238,"2320RR",382000,300002]
[59239,"AC","FC Academic Support","FC","AS",59239,"304DAC",304000,300001]
[59240,"IN","FC Instruction","FC","I",59240,"3016IN",301000,300001]
[59241,"IN","FC Instruction","FC","I",59241,"3011IN",301000,300001]
[59242,"AM","FC Academic Support","FC","AS",59242,"3040AM",304000,300001]
[59243,"RR","FOR Research","FOR","R",59243,"2320RR",382000,300002]
[59244,"IN","FC Instruction","FC","I",59244,"3010IN",301000,300001]
[59245,"IN","FC Instruction","FC","I",59245,"3010IN",301000,300001]
[59246,"IN","FC Instruction","FC","I",59246,"3010IN",301000,300001]
[59247,"IN","FC Instruction","FC","I",59247,"3010IN",301000,300001]
[59248,"IN","FC Instruction","FC","I",59248,"3010IN",301000,300001]
[59249,"IN","FC Instruction","FC","I",59249,"3010IN",301000,300001]
[59250,"IN","FC Instruction","FC","I",59250,"3010IN",301000,300001]
[59251,"IN","FC Instruction","FC","I",59251,"3010IN",301000,300001]
[{"$f":"IF(F1588>0,VALUE(F1588),\" \")","v":59252},{"$f":"IF(A1588<>\" \",RIGHT(G1588,2),\" \")","v":"IN"},{"$f":"IF(A1588<>\" \",VLOOKUP(H1588,ALLOC_NCHEMS,2,0),\" \")","v":"FC Instruction"},{"$f":"IF(A1588<>\" \",VLOOKUP(I1588,ALLOC,2,0),\" \")","v":"FC"},"I",59252,"3010IN",301000,300001]
[59253,"SZ","FC Student Services","FC","SS",59253,"3050SZ",305000,300001]
[59254,"IN","FC Instruction","FC","I",59254,"3012IN",301000,300001]
[59255,"IN","FC Instruction","FC","I",59255,"3016IN",301000,300001]
[59256,"IN","FC Instruction","FC","I",59256,"3016IN",301000,300001]
[59257,"IN","FC Instruction","FC","I",59257,"3016IN",301000,300001]
[59258,"AL","FC Library Services","FC","L",59258,"304AAL",304500,300001]
[59259,"AL","FC Library Services","FC","L",59259,"304AAL",304500,300001]
[59260,"AL","FC Library Services","FC","L",59260,"304AAL",304500,300001]
[59261,"IN","FC Instruction","FC","I",59261,"3010IN",301000,300001]
[59262,"IN","FC Instruction","FC","I",59262,"3910IN",301000,300001]
[59263,"IN","FC Instruction","FC","I",59263,"3016IN",301000,300001]
[59264,"IN","FC Instruction","FC","I",59264,"3013IN",301000,300001]
[59265,"IN","FC Instruction","FC","I",59265,"3010IN",301000,300001]
[59266,"IN","FC Instruction","FC","I",59266,"3010IN",301000,300001]
[59267,"IN","FC Instruction","FC",{"$f":"IF(A1603<>\" \",VLOOKUP(B1603,NCHEMS_ABBR,3,0),\" \")","v":"I"},59267,"3016IN",301000,300001]
[59268,"IN","FC Instruction","FC","I",59268,"3010IN",301000,300001]
[59269,"IN","FC Instruction","FC","I",59269,"3010IN",301000,300001]
[59270,"IN","FC Instruction","FC","I",59270,"3016IN",301000,300001]
[59271,"IN","FC Instruction","FC","I",59271,"3016IN",301000,300001]
[59272,"AL","FC Library Services","FC","L",59272,"304AAL",304500,300001]
[59273,"SZ","FC Student Services","FC","SS",59273,"3050SZ",305000,300001]
[59274,"AL","FC Library Services","FC","L",59274,"304AAL",304500,300001]
[59275,"IN","FC Instruction","FC","I",59275,"3016IN",301000,300001]
[59276,"IN","FC Instruction","FC","I",59276,"3010IN",301000,300001]
[59277,"IN","FC Instruction","FC","I",59277,"3016IN",301000,300001]
[59278,"IN","FC Instruction","FC","I",59278,"3016IN",301000,300001]
[59279,"IN","FC Instruction","FC","I",59279,"3011IN",301000,300001]
[59280,"IN","FC Instruction","FC","I",59280,"3016IN",301000,300001]
[59281,"IN","FC Instruction","FC","I",59281,"3016IN",301000,300001]
[59282,"AL","FC Library Services","FC","L",59282,"304AAL",304500,300001]
[59283,"AL","FC Library Services","FC","L",59283,"304AAL",304500,300001]
[59284,"IN","FC Instruction","FC","I",59284,"3010IN",301000,300001]
[59285,"IN","FC Instruction","FC","I",59285,"3013IN",301000,300001]
[59286,"IN","FC Instruction","FC","I",59286,"3010IN",301000,300001]
[59287,"IN","FC Instruction","FC","I",59287,"3013IN",301000,300001]
[59288,"IN","FC Instruction","FC","I",59288,"3010IN",301000,300001]
[59289,"IN","FC Instruction","FC","I",59289,"3010IN",301000,300001]
[59290,"AL","FC Library Services","FC","L",59290,"304AAL",304500,300001]
[59291,"IN","FC Instruction","FC","I",59291,"3010IN",301000,300001]
[59292,"IN","FC Instruction","FC","I",59292,"3016IN",301000,300001]
[59293,"IN","FC Instruction","FC","I",59293,"3010IN",301000,300001]
[59294,"IN","FC Instruction","FC","I",59294,"3013IN",301000,300001]
[59295,"IN","FC Instruction","FC","I",59295,"3010IN",301000,300001]
[59296,"IN","FC Instruction","FC","I",59296,"3016IN",301000,300001]
[59297,"SZ","FC Student Services","FC","SS",59297,"3050SZ",305000,300001]
[59301,"OM","FC Physical Plant","FC","PP",59301,"3073OM",307000,300001]
[59302,"RR","FOR Research","FOR","R",59302,"3826RR",382000,300002]
[59303,"RR","FOR Research","FOR","R",59303,"3826RR",382000,300002]
[59304,"RR","FOR Research","FOR","R",59304,"3826RR",382000,300002]
[59305,"RR","FOR Research","FOR","R",59305,"3826RR",382000,300002]
[59306,"RR","FOR Research","FOR","R",59306,"3826RR",382000,300002]
[59307,"RR","FOR Research","FOR","R",59307,"3826RR",382000,300002]
[59308,"GA","FC Institutional Support","FC","IS",59308,"3061GA",306000,300001]
[59309,"OM","FC Physical Plant","FC","PP",59309,"3073OM",307000,300001]
[59310,"OM","FC Physical Plant","FC","PP",59310,"3073OM",307000,300001]
[59311,"OM","FC Physical Plant","FC","PP",59311,"3073OM",307000,300001]
[59312,"OM","FC Physical Plant","FC","PP",59312,"3073OM",307000,300001]
[59313,"OM","FC Physical Plant","FC","PP",59313,"3073OM",307000,300001]
[59314,"OM","FC Physical Plant","FC","PP",59314,"3073OM",307000,300001]
[59315,"OM","FC Physical Plant","FC","PP",59315,"3073OM",307000,300001]
[59316,"OM","FC Physical Plant","FC","PP",59316,"3073OM",307000,300001]
[59317,"OM","FC Physical Plant","FC","PP",59317,"3073OM",307000,300001]
[59318,"OM","FC Physical Plant","FC","PP",59318,"3073OM",307000,300001]
[{"$f":"IF(F1652>0,VALUE(F1652),\" \")","v":59319},{"$f":"IF(A1652<>\" \",RIGHT(G1652,2),\" \")","v":"OM"},{"$f":"IF(A1652<>\" \",VLOOKUP(H1652,ALLOC_NCHEMS,2,0),\" \")","v":"FC Physical Plant"},{"$f":"IF(A1652<>\" \",VLOOKUP(I1652,ALLOC,2,0),\" \")","v":"FC"},"PP",59319,"3073OM",307000,300001]
[59321,"OM","FC Physical Plant","FC","PP",59321,"3075OM",307000,300001]
[59322,"OM","FC Physical Plant","FC","PP",59322,"3075OM",307000,300001]
[59323,"OZ","FC Physical Plant","FC","PP",59323,"3075OZ",307000,300001]
[59324,"OM","FC Physical Plant","FC","PP",59324,"3075OM",307000,300001]
[59325,"OM","FC Physical Plant","FC","PP",59325,"3075OM",307000,300001]
[59326,"OM","FC Physical Plant","FC","PP",59326,"3075OM",307000,300001]
[59327,"OM","FC Physical Plant","FC","PP",59327,"3075OM",307000,300001]
[59328,"OM","FC Physical Plant","FC","PP",59328,"3075OM",307000,300001]
[59329,"OM","FC Physical Plant","FC","PP",59329,"3075OM",307000,300001]
[59330,"OM","FC Physical Plant","FC","PP",59330,"3073OM",307000,300001]
[59331,"OM","FC Physical Plant","FC","PP",59331,"3075OM",307000,300001]
[59332,"OM","FC Physical Plant","FC","PP",59332,"3075OM",307000,300001]
[60000,"AL","FC Library Services","FC","L",60000,"304AAL",304500,300001]
[60001,"AL","FC Library Services","FC","L",60001,"304AAL",304500,300001]
[60002,"AL","FC Library Services","FC",{"$f":"IF(A1667<>\" \",VLOOKUP(B1667,NCHEMS_ABBR,3,0),\" \")","v":"L"},60002,"304AAL",304500,300001]
[60003,"AL","FC Library Services","FC","L",60003,"304AAL",304500,300001]
[60004,"AL","FC Library Services","FC","L",60004,"304AAL",304500,300001]
[60005,"AL","FC Library Services","FC","L",60005,"304AAL",304500,300001]
[60006,"AL","FC Library Services","FC","L",60006,"304AAL",304500,300001]
[60007,"AZ","FC Library Services","FC","AS",60007,"304AAZ",304500,300001]
[60008,"AL","FC Library Services","FC","L",60008,"304AAL",304500,300001]
[60009,"AL","FC Library Services","FC","L",60009,"304AAL",304500,300001]
[60010,"AL","FC Library Services","FC","L",60010,"304AAL",304500,300001]
[60011,"AL","FC Library Services","FC","L",60011,"304AAL",304500,300001]
[60012,"AS","FC Academic Support","FC","AS",60012,"304AAS",304000,300001]
[60013,"AL","FC Library Services","FC","L",60013,"304AAL",304500,300001]
[60014,"AL","FC Library Services","FC","L",60014,"304AAL",304500,300001]
[60015,"AL","FC Library Services","FC","L",60015,"304AAL",304500,300001]
[60016,"AS","FC Academic Support","FC","AS",60016,"304AAS",304000,300001]
[60017,"AS","FC Academic Support","FC","AS",60017,"304AAS",304000,300001]
[60018,"IN","FC Instruction","FC","I",60018,"3017IN",301000,300001]
[60019,"RR","FOR Research","FOR","R",60019,"3828RR",382000,300002]
[60020,"GM","FC Institutional Support","FC","IS",60020,"3068GM",306000,300001]
[60021,"GA","FC Institutional Support","FC","IS",60021,"3062GA",306000,300001]
[60022,"AC","FC Academic Support","FC","AS",60022,"3043AC",304000,300001]
[60023,"ID","FC Instruction","FC","I",60023,"3018ID",301000,300001]
[60024,"RM","FOR Research","FOR","R",60024,"3828RM",382000,300002]
[60025,"SS","FC Student Services","FC","SS",60025,"3062SS",305000,300001]
[60026,"RR","FOR Research","FOR","R",60026,"3828RR",382000,300002]
[60027,"RD","FOR Research","FOR","R",60027,"3828RD",382000,300002]
[60028,"RM","FOR Research","FOR","R",60028,"3828RM",382000,300002]
[60029,"RM","FOR Research","FOR","R",60029,"3828RM",382000,300002]
[60030,"IN","FC Instruction","FC","I",60030,"3018IN",301000,300001]
[60031,"PS","FC Public Service","FC","PS",60031,"3039PS",303000,300001]
[60032,"PS","FOR Public Service","FOR","PS",60032,"3828PS",383000,300002]
[60033,"PS","FC Public Service","FC","PS",60033,"3031PS",303000,300001]
[60034,"RT","FOR Research","FOR","R",60034,"3828RT",382000,300002]
[60035,"IN","FOR Instruction","FOR","I",60035,"3828IN",381000,300002]
[60036,"FA","FC Scholarships","FC","FA",60036,"3084FA",308000,300001]
[60037,"AC","FC Academic Support","FC","AS",60037,"3043AC",304000,300001]
[60038,"FA","FC Scholarships","FC","FA",60038,"3084FA",308000,300001]
[60039,"PS","FC Public Service","FC","PS",60039,"3039PS",303000,300001]
[60040,"PS","FC Public Service","FC","PS",60040,"3039PS",303000,300001]
[60041,"GA","FC Institutional Support","FC","IS",60041,"3062GA",306000,300001]
[60042,"IN","FC Instruction","FC","I",60042,"3017IN",301000,300001]
[60043,"GA","FC Institutional Support","FC","IS",60043,"3062GA",306000,300001]
[60044,"AS","FC Academic Support","FC","AS",60044,"3043AS",304000,300001]
[60045,"RR","FOR Research","FOR","R",60045,"3828RR",382000,300002]
[60046,"RD","FOR Research","FOR","R",60046,"3860RD",382000,300002]
[60047,"GP","FOR Institutional Supt","FOR","IS",60047,"3868GP",386000,300002]
[60048,"FA","FC Scholarships","FC","FA",60048,"3080FA",308000,300001]
[60049,"RR","FOR Research","FOR","R",60049,"3828RR",382000,300002]
[60050,"RR","FOR Research","FOR","R",60050,"3828RR",382000,300002]
[{"$f":"IF(F1716>0,VALUE(F1716),\" \")","v":60051},{"$f":"IF(A1716<>\" \",RIGHT(G1716,2),\" \")","v":"GA"},{"$f":"IF(A1716<>\" \",VLOOKUP(H1716,ALLOC_NCHEMS,2,0),\" \")","v":"FOR Institutional Supt"},{"$f":"IF(A1716<>\" \",VLOOKUP(I1716,ALLOC,2,0),\" \")","v":"FOR"},"IS",60051,"3828GA",386000,300002]
[60052,"IR","FC Instruction","FC","I",60052,"3018IR",301000,300001]
[60053,"PS","FOR Public Service","FOR","PS",60053,"3828PS",383000,300002]
[60054,"RD","FOR Research","FOR","R",60054,"3828RD",382000,300002]
[60055,"RR","FOR Research","FOR","R",60055,"3828RR",382000,300002]
[60056,"FA","FOR Financial Aid/Schol","FOR","FA",60056,"3880FA",388000,300002]
[60057,"RR","FOR Research","FOR","R",60057,"3828RR",382000,300002]
[60058,"PS","FOR Public Service","FOR","PS",60058,"3828PS",383000,300002]
[60059,"RR","FOR Research","FOR","R",60059,"3828RR",382000,300002]
[60060,"RD","FOR Research","FOR","R",60060,"3828RD",382000,300002]
[60061,"RD","FOR Research","FOR","R",60061,"3860RD",382000,300002]
[60062,"RR","FOR Research","FOR","R",60062,"3828RR",382000,300002]
[60063,"RR","FOR Research","FOR","R",60063,"3828RR",382000,300002]
[60064,"PS","FOR Public Service","FOR","PS",60064,"3828PS",383000,300002]
[60065,"IN","FC Instruction","FC","I",60065,"301GIN",301000,300001]
[60066,"GA","FC Institutional Support","FC",{"$f":"IF(A1731<>\" \",VLOOKUP(B1731,NCHEMS_ABBR,3,0),\" \")","v":"IS"},60066,"3062GA",306000,300001]
[60067,"PS","FOR Public Service","FOR","PS",60067,"3828PS",383000,300002]
[60068,"IN","FC Instruction","FC","I",60068,"301GIN",301000,300001]
[60069,"RD","FOR Research","FOR","R",60069,"3860RD",382000,300002]
[60070,"AC","FC Academic Support","FC","AS",60070,"304FAC",304000,300001]
[60071,"AC","FC Academic Support","FC","AS",60071,"304FAC",304000,300001]
[60072,"AC","FC Academic Support","FC","AS",60072,"3043AC",304000,300001]
[60073,"AC","FC Academic Support","FC","AS",60073,"3043AC",304000,300001]
[60074,"AC","FC Academic Support","FC","AS",60074,"3043AC",304000,300001]
[60075,"AC","FC Academic Support","FC","AS",60075,"3043AC",304000,300001]
[60076,"AS","FC Academic Support","FC","AS",60076,"3043AS",304000,300001]
[60077,"UX","FC Auxiliary Services","FC","AUX",60077,"3097UX",309000,300001]
[60078,"FA","FC Scholarships","FC","FA",60078,"3080FA",308000,300001]
[60079,"AY","FC Library Services","FC","AS",60079,"304AAY",304500,300001]
[60080,"AL","FC Library Services","FC","L",60080,"304AAL",304500,300001]
[60081,"AY","FC Library Services","FC","AS",60081,"304AAY",304500,300001]
[60082,"AL","FC Library Services","FC","L",60082,"304AAL",304500,300001]
[60083,"AL","FC Library Services","FC","L",60083,"304AAL",304500,300001]
[60085,"AC","FC Academic Support","FC","AS",60085,"304DAC",304000,300001]
[60086,"AL","FC Library Services","FC","L",60086,"304AAL",304500,300001]
[60087,"SS","FC Student Services","FC","SS",60087,"3050SS",305000,300001]
[60088,"IM","FC Instruction","FC","I",60088,"3017IM",301000,300001]
[60089,"SZ","FC Student Services","FC","SS",60089,"3062SZ",305000,300001]
[60090,"SS","FC Student Services","FC","SS",60090,"3062SS",305000,300001]
[60091,"ID","FC Instruction","FC","I",60091,"3017ID",301000,300001]
[60092,"IN","FC Instruction","FC","I",60092,"3017IN",301000,300001]
[60093,"AS","FC Academic Support","FC","AS",60093,"3043AS",304000,300001]
[60094,"SS","FC Student Services","FC","SS",60094,"3062SS",305000,300001]
[60095,"SS","FC Student Services","FC","SS",60095,"3053SS",305000,300001]
[60096,"SS","FC Student Services","FC","SS",60096,"3062SS",305000,300001]
[60097,"SS","FC Student Services","FC","SS",60097,"3053SS",305000,300001]
[60098,"FA","FC Scholarships","FC","FA",60098,"3087FA",308000,300001]
[60099,"IN","FC Instruction","FC","I",60099,"3017IN",301000,300001]
[60100,"RR","FOR Research","FOR","R",60100,"382RRR",382000,300002]
[60101,"RR","FOR Research","FOR","R",60101,"382RRR",382000,300002]
[60102,"PS","FOR Public Service","FOR","PS",60102,"382RPS",383000,300002]
[60103,"RR","FOR Research","FOR","R",60103,"382RRR",382000,300002]
[60104,"GA","FOR Institutional Supt","FOR","IS",60104,"3828GA",386000,300002]
[60105,"GA","FOR Institutional Supt","FOR","IS",60105,"3828GA",386000,300002]
[60106,"FA","FC Scholarships","FC","FA",60106,"308AFA",308000,300001]
[60107,"FA","FC Scholarships","FC","FA",60107,"308AFA",308000,300001]
[60108,"GA","FC Institutional Support","FC","IS",60108,"3062GA",306000,300001]
[60109,"PS","FOR Public Service","FOR","PS",60109,"3828PS",383000,300002]
[60110,"RR","FOR Research","FOR","R",60110,"382RRR",382000,300002]
[60111,"RR","FOR Research","FOR","R",60111,"382RRR",382000,300002]
[60112,"IN","FC Instruction","FC","I",60112,"301DIN",301000,300001]
[60113,"RO","FC Research","FC","R",60113,"3021RO",302000,300001]
[60114,"GA","FC Institutional Support","FC","IS",60114,"3067GA",306000,300001]
[60115,"FA","FC Scholarships","FC","FA",60115,"3080FA",308000,300001]
[{"$f":"IF(F1780>0,VALUE(F1780),\" \")","v":60116},{"$f":"IF(A1780<>\" \",RIGHT(G1780,2),\" \")","v":"SY"},{"$f":"IF(A1780<>\" \",VLOOKUP(H1780,ALLOC_NCHEMS,2,0),\" \")","v":"FC Student Services"},{"$f":"IF(A1780<>\" \",VLOOKUP(I1780,ALLOC,2,0),\" \")","v":"FC"},"SS",60116,"3052SY",305000,300001]
[60117,"RT","FOR Research","FOR","R",60117,"3828RT",382000,300002]
[60118,"GA","FOR Institutional Supt","FOR","IS",60118,"3828GA",386000,300002]
[60119,"RD","FOR Research","FOR","R",60119,"3828RD",382000,300002]
[60120,"AS","FC Academic Support","FC","AS",60120,"304AAS",304000,300001]
[60121,"IN","FC Instruction","FC","I",60121,"3018IN",301000,300001]
[60122,"GA","FOR Institutional Supt","FOR","IS",60122,"3828GA",386000,300002]
[60123,"PS","FC Public Service","FC","PS",60123,"3039PS",303000,300001]
[60124,"IN","FC Instruction","FC","I",60124,"3017IN",301000,300001]
[60125,"GA","FOR Institutional Supt","FOR","IS",60125,"3828GA",386000,300002]
[60126,"RO","FC Research","FC","R",60126,"3018RO",302000,300001]
[60127,"PS","FC Public Service","FC","PS",60127,"3039PS",303000,300001]
[60128,"IN","FC Instruction","FC","I",60128,"3018IN",301000,300001]
[60129,"PS","FC Public Service","FC","PS",60129,"3039PS",303000,300001]
[60130,"IN","FC Instruction","FC","I",60130,"3018IN",301000,300001]
[60131,"PS","FC Public Service","FC",{"$f":"IF(A1795<>\" \",VLOOKUP(B1795,NCHEMS_ABBR,3,0),\" \")","v":"PS"},60131,"3039PS",303000,300001]
[60132,"PS","FC Public Service","FC","PS",60132,"3039PS",303000,300001]
[60150,"IN","FC Instruction","FC","I",60150,"3017IN",301000,300001]
[60151,"PS","FC Public Service","FC","PS",60151,"3031PS",303000,300001]
[60152,"FA","FC Scholarships","FC","FA",60152,"3080FA",308000,300001]
[60153,"SS","FC Student Services","FC","SS",60153,"3052SS",305000,300001]
[60160,"AS","FC Academic Support","FC","AS",60160,"3043AS",304000,300001]
[60161,"IN","FC Instruction","FC","I",60161,"301GIN",301000,300001]
[60162,"FA","FC Scholarships","FC","FA",60162,"3080FA",308000,300001]
[60163,"IN","FC Instruction","FC","I",60163,"301GIN",301000,300001]
[60164,"IN","FC Instruction","FC","I",60164,"301GIN",301000,300001]
[60165,"PS","FC Public Service","FC","PS",60165,"3030PS",303000,300001]
[60166,"IR","FC Instruction","FC","I",60166,"3017IR",301000,300001]
[60167,"IN","FC Instruction","FC","I",60167,"3017IN",301000,300001]
[60168,"FA","FC Scholarships","FC","FA",60168,"3080FA",308000,300001]
[60169,"IN","FC Instruction","FC","I",60169,"3017IN",301000,300001]
[60170,"SS","FC Student Services","FC","SS",60170,"3062SS",305000,300001]
[60171,"SS","FC Student Services","FC","SS",60171,"3062SS",305000,300001]
[60172,"RO","FC Research","FC","R",60172,"302GRO",302000,300001]
[60173,"IR","FC Instruction","FC","I",60173,"3017IR",301000,300001]
[60174,"IN","FC Instruction","FC","I",60174,"3017IN",301000,300001]
[60175,"IR","FC Instruction","FC","I",60175,"3017IR",301000,300001]
[60176,"SS","FC Student Services","FC","SS",60176,"3062SS",305000,300001]
[60177,"SS","FC Student Services","FC","SS",60177,"3062SS",305000,300001]
[60178,"FA","FC Scholarships","FC","FA",60178,"3087FA",308000,300001]
[60179,"SS","FC Student Services","FC","SS",60179,"3062SS",305000,300001]
[60180,"RR","FOR Research","FOR","R",60180,"3828RR",382000,300002]
[60181,"RR","FOR Research","FOR","R",60181,"3828RR",382000,300002]
[60182,"RR","FOR Research","FOR","R",60182,"3828RR",382000,300002]
[60183,"RR","FOR Research","FOR","R",60183,"3828RR",382000,300002]
[60184,"RR","FOR Research","FOR","R",60184,"3828RR",382000,300002]
[60185,"RR","FOR Research","FOR","R",60185,"3828RR",382000,300002]
[60186,"PS","FOR Public Service","FOR","PS",60186,"3828PS",383000,300002]
[60187,"RD","FOR Research","FOR","R",60187,"3828RD",382000,300002]
[60188,"FA","FOR Financial Aid/Schol","FOR","FA",60188,"3880FA",388000,300002]
[60189,"FA","FOR Financial Aid/Schol","FOR","FA",60189,"3880FA",388000,300002]
[60190,"RR","FOR Research","FOR","R",60190,"3828RR",382000,300002]
[60191,"RO","FC Research","FC","R",60191,"304FRO",302000,300001]
[60192,"RO","FOR Research","FOR","R",60192,"3828RO",382000,300002]
[60193,"RR","FOR Research","FOR","R",60193,"3828RR",382000,300002]
[60194,"RD","FOR Research","FOR","R",60194,"3828RD",382000,300002]
[60195,"PS","FOR Public Service","FOR","PS",60195,"3828PS",383000,300002]
[60199,"ID","FC Instruction","FC","I",60199,"3017ID",301000,300001]
[60200,"PY","FC Public Service","FC","PS",60200,"3031PY",303000,300001]
[60201,"PY","FC Public Service","FC","PS",60201,"3031PY",303000,300001]
[60202,"IN","FC Instruction","FC","I",60202,"3018IN",301000,300001]
[60203,"PD","FC Public Service","FC","PS",60203,"3039PD",303000,300001]
[60204,"PD","FC Public Service","FC","PS",60204,"3039PD",303000,300001]
[60205,"AC","FC Academic Support","FC","AS",60205,"3043AC",304000,300001]
[{"$f":"IF(F1844>0,VALUE(F1844),\" \")","v":60209},{"$f":"IF(A1844<>\" \",RIGHT(G1844,2),\" \")","v":"RR"},{"$f":"IF(A1844<>\" \",VLOOKUP(H1844,ALLOC_NCHEMS,2,0),\" \")","v":"FOR Research"},{"$f":"IF(A1844<>\" \",VLOOKUP(I1844,ALLOC,2,0),\" \")","v":"FOR"},"R",60209,"3828RR",382000,300002]
[60210,"FA","FOR Financial Aid/Schol","FOR","FA",60210,"3828FA",388000,300002]
[60211,"RR","FOR Research","FOR","R",60211,"3828RR",382000,300002]
[60212,"RR","FOR Research","FOR","R",60212,"3828RR",382000,300002]
[60213,"RR","FOR Research","FOR","R",60213,"3828RR",382000,300002]
[60214,"OM","FOR Research","FOR","PP",60214,"3828OM",382000,300002]
[60215,"RR","FOR Research","FOR","R",60215,"3828RR",382000,300002]
[60216,"RD","FOR Research","FOR","R",60216,"3828RD",382000,300002]
[60217,"RR","FOR Research","FOR","R",60217,"3828RR",382000,300002]
[60218,"FA","FOR Financial Aid/Schol","FOR","FA",60218,"3828FA",388000,300002]
[60219,"RD","FOR Research","FOR","R",60219,"3828RD",382000,300002]
[60220,"RR","FOR Research","FOR","R",60220,"3828RR",382000,300002]
[60221,"PS","FOR Public Service","FOR","PS",60221,"3828PS",383000,300002]
[60222,"GA","FOR Institutional Supt","FOR","IS",60222,"3828GA",386000,300002]
[60223,"PS","FOR Public Service","FOR","PS",60223,"3828PS",383000,300002]
[60224,"PS","FOR Public Service","FOR",{"$f":"IF(A1859<>\" \",VLOOKUP(B1859,NCHEMS_ABBR,3,0),\" \")","v":"PS"},60224,"3828PS",383000,300002]
[60225,"RR","FOR Research","FOR","R",60225,"3828RR",382000,300002]
[60226,"PS","FOR Public Service","FOR","PS",60226,"3828PS",383000,300002]
[60227,"PS","FOR Public Service","FOR","PS",60227,"3828PS",383000,300002]
[60228,"PS","FOR Public Service","FOR","PS",60228,"3828PS",383000,300002]
[60229,"RR","FOR Research","FOR","R",60229,"3828RR",382000,300002]
[60230,"GA","FC Institutional Support","FC","IS",60230,"3061GA",306000,300001]
[60240,"GA","FC Institutional Support","FC","IS",60240,"3062GA",306000,300001]
[60245,"GA","FC Institutional Support","FC","IS",60245,"3062GA",306000,300001]
[60250,"RY","FOR Research","FOR","R",60250,"3828RY",382000,300002]
[60252,"RR","FOR Research","FOR","R",60252,"3828RR",382000,300002]
[60253,"GA","FOR Institutional Supt","FOR","IS",60253,"3828GA",386000,300002]
[60260,"RR","FOR Research","FOR","R",60260,"3828RR",382000,300002]
[60261,"RR","FOR Research","FOR","R",60261,"3828RR",382000,300002]
[60262,"RR","FOR Research","FOR","R",60262,"3828RR",382000,300002]
[60263,"RR","FOR Research","FOR","R",60263,"3828RR",382000,300002]
[60264,"RR","FOR Research","FOR","R",60264,"3828RR",382000,300002]
[60265,"GA","FOR Institutional Supt","FOR","IS",60265,"3828GA",386000,300002]
[60266,"PS","FOR Public Service","FOR","PS",60266,"3828PS",383000,300002]
[60267,"RR","FOR Research","FOR","R",60267,"3828RR",382000,300002]
[60268,"RR","FOR Research","FOR","R",60268,"3828RR",382000,300002]
[60269,"RR","FOR Research","FOR","R",60269,"3828RR",382000,300002]
[60270,"RR","FOR Research","FOR","R",60270,"3828RR",382000,300002]
[60271,"RR","FOR Research","FOR","R",60271,"3828RR",382000,300002]
[60272,"RR","FOR Research","FOR","R",60272,"3828RR",382000,300002]
[60273,"RD","FOR Research","FOR","R",60273,"3828RD",382000,300002]
[60274,"RR","FOR Research","FOR","R",60274,"3828RR",382000,300002]
[60275,"FA","FOR Financial Aid/Schol","FOR","FA",60275,"3828FA",388000,300002]
[60276,"RD","FOR Research","FOR","R",60276,"3828RD",382000,300002]
[60277,"RR","FOR Research","FOR","R",60277,"3828RR",382000,300002]
[60278,"FA","FOR Financial Aid/Schol","FOR","FA",60278,"3828FA",388000,300002]
[60279,"RR","FOR Research","FOR","R",60279,"3828RR",382000,300002]
[60280,"GA","FOR Institutional Supt","FOR","IS",60280,"3828GA",386000,300002]
[60281,"RR","FOR Research","FOR","R",60281,"3828RR",382000,300002]
[60282,"RR","FOR Research","FOR","R",60282,"3828RR",382000,300002]
[60283,"RD","FOR Research","FOR","R",60283,"3828RD",382000,300002]
[60284,"RT","FOR Research","FOR","R",60284,"3828RT",382000,300002]
[60285,"RD","FOR Research","FOR","R",60285,"3828RD",382000,300002]
[60286,"RD","FOR Research","FOR","R",60286,"3828RD",382000,300002]
[60287,"RD","FOR Research","FOR","R",60287,"3828RD",382000,300002]
[60288,"RD","FOR Research","FOR","R",60288,"3860RD",382000,300002]
[60289,"FA","FOR Financial Aid/Schol","FOR","FA",60289,"3828FA",388000,300002]
[60290,"RR","FOR Research","FOR","R",60290,"3828RR",382000,300002]
[60291,"RR","FOR Research","FOR","R",60291,"3828RR",382000,300002]
[60292,"GA","FOR Institutional Supt","FOR","IS",60292,"3828GA",386000,300002]
[60293,"RY","FOR Research","FOR","R",60293,"3828RY",382000,300002]
[60294,"RR","FOR Research","FOR","R",60294,"3828RR",382000,300002]
[60295,"RR","FOR Research","FOR","R",60295,"3828RR",382000,300002]
[60296,"RY","FOR Research","FOR","R",60296,"3828RY",382000,300002]
[{"$f":"IF(F1908>0,VALUE(F1908),\" \")","v":60297},{"$f":"IF(A1908<>\" \",RIGHT(G1908,2),\" \")","v":"RY"},{"$f":"IF(A1908<>\" \",VLOOKUP(H1908,ALLOC_NCHEMS,2,0),\" \")","v":"FOR Research"},{"$f":"IF(A1908<>\" \",VLOOKUP(I1908,ALLOC,2,0),\" \")","v":"FOR"},"R",60297,"3828RY",382000,300002]
[60298,"RY","FOR Research","FOR","R",60298,"3828RY",382000,300002]
[60299,"PS","FOR Public Service","FOR","PS",60299,"3828PS",383000,300002]
[60300,"GA","FOR Institutional Supt","FOR","IS",60300,"3828GA",386000,300002]
[60301,"PS","FOR Public Service","FOR","PS",60301,"3828PS",383000,300002]
[60302,"RT","FOR Research","FOR","R",60302,"3828RT",382000,300002]
[60303,"PS","FOR Public Service","FOR","PS",60303,"3828PS",383000,300002]
[60304,"RR","FOR Research","FOR","R",60304,"3828RR",382000,300002]
[60305,"GA","FOR Institutional Supt","FOR","IS",60305,"3828GA",386000,300002]
[60306,"GA","FOR Institutional Supt","FOR","IS",60306,"3828GA",386000,300002]
[60307,"RR","FOR Research","FOR","R",60307,"3828RR",382000,300002]
[60308,"RR","FOR Research","FOR","R",60308,"3828RR",382000,300002]
[60309,"RR","FOR Research","FOR","R",60309,"3828RR",382000,300002]
[60310,"RR","FOR Research","FOR","R",60310,"3828RR",382000,300002]
[60311,"RR","FOR Research","FOR","R",60311,"3828RR",382000,300002]
[60312,"RR","FOR Research","FOR",{"$f":"IF(A1923<>\" \",VLOOKUP(B1923,NCHEMS_ABBR,3,0),\" \")","v":"R"},60312,"3828RR",382000,300002]
[60313,"RD","FOR Research","FOR","R",60313,"3828RD",382000,300002]
[60314,"RR","FOR Research","FOR","R",60314,"3828RR",382000,300002]
[60315,"RT","FOR Research","FOR","R",60315,"3828RT",382000,300002]
[60316,"RD","FOR Research","FOR","R",60316,"3828RD",382000,300002]
[60317,"GA","FOR Institutional Supt","FOR","IS",60317,"3828GA",386000,300002]
[60319,"GA","FOR Institutional Supt","FOR","IS",60319,"3828GA",386000,300002]
[60321,"FA","FOR Financial Aid/Schol","FOR","FA",60321,"3828FA",388000,300002]
[60323,"RR","FOR Research","FOR","R",60323,"3828RR",382000,300002]
[60325,"RR","FOR Research","FOR","R",60325,"3828RR",382000,300002]
[60327,"RT","FOR Research","FOR","R",60327,"3828RT",382000,300002]
[60333,"RR","FOR Research","FOR","R",60333,"3828RR",382000,300002]
[60335,"RR","FOR Research","FOR","R",60335,"3828RR",382000,300002]
[60337,"RR","FOR Research","FOR","R",60337,"3828RR",382000,300002]
[60339,"RR","FOR Research","FOR","R",60339,"3828RR",382000,300002]
[60400,"AC","FC Academic Support","FC","AS",60400,"304DAC",304000,300001]
[60401,"AC","FC Academic Support","FC","AS",60401,"304DAC",304000,300001]
[60402,"AC","FC Academic Support","FC","AS",60402,"304DAC",304000,300001]
[60403,"AC","FC Academic Support","FC","AS",60403,"304DAC",304000,300001]
[60404,"AC","FC Academic Support","FC","AS",60404,"304DAC",304000,300001]
[60405,"AC","FC Academic Support","FC","AS",60405,"304DAC",304000,300001]
[60406,"AC","FC Academic Support","FC","AS",60406,"304DAC",304000,300001]
[60407,"AC","FC Academic Support","FC","AS",60407,"304DAC",304000,300001]
[60408,"AY","FC Academic Support","FC","AS",60408,"304DAY",304000,300001]
[60409,"AY","FC Academic Support","FC","AS",60409,"304DAY",304000,300001]
[60410,"AC","FC Academic Support","FC","AS",60410,"304DAC",304000,300001]
[60411,"AC","FC Academic Support","FC","AS",60411,"304DAC",304000,300001]
[60412,"AC","FC Academic Support","FC","AS",60412,"304DAC",304000,300001]
[60413,"AC","FC Academic Support","FC","AS",60413,"304DAC",304000,300001]
[60414,"AC","FC Academic Support","FC","AS",60414,"304DAC",304000,300001]
[60415,"AC","FC Academic Support","FC","AS",60415,"304DAC",304000,300001]
[60416,"AC","FC Academic Support","FC","AS",60416,"304DAC",304000,300001]
[60417,"AC","FC Academic Support","FC","AS",60417,"304DAC",304000,300001]
[60418,"AC","FC Academic Support","FC","AS",60418,"304DAC",304000,300001]
[60419,"AC","FC Academic Support","FC","AS",60419,"304DAC",304000,300001]
[60420,"AY","FC Academic Support","FC","AS",60420,"304DAY",304000,300001]
[60421,"AC","FC Academic Support","FC","AS",60421,"304DAC",304000,300001]
[60422,"AC","FC Academic Support","FC","AS",60422,"304DAC",304000,300001]
[60423,"AY","FC Academic Support","FC","AS",60423,"304DAY",304000,300001]
[60424,"AC","FC Academic Support","FC","AS",60424,"304DAC",304000,300001]
[60425,"GY","FC Institutional Support","FC","IS",60425,"306AGY",306000,300001]
[60504,"IN","FC Instruction","FC","I",60504,"3017IN",301000,300001]
[60505,"AS","FC Academic Support","FC","AS",60505,"3048AS",304000,300001]
[60506,"IM","FC Instruction","FC","I",60506,"3017IM",301000,300001]
[60507,"IN","FC Instruction","FC","I",60507,"3017IN",301000,300001]
[60508,"ID","FC Instruction","FC","I",60508,"3017ID",301000,300001]
[60509,"ID","FC Instruction","FC","I",60509,"3017ID",301000,300001]
[60511,"IN","FC Instruction","FC","I",60511,"3017IN",301000,300001]
[60512,"AS","FC Academic Support","FC","AS",60512,"3048AS",304000,300001]
[{"$f":"IF(F1972>0,VALUE(F1972),\" \")","v":60513},{"$f":"IF(A1972<>\" \",RIGHT(G1972,2),\" \")","v":"AS"},{"$f":"IF(A1972<>\" \",VLOOKUP(H1972,ALLOC_NCHEMS,2,0),\" \")","v":"FC Academic Support"},{"$f":"IF(A1972<>\" \",VLOOKUP(I1972,ALLOC,2,0),\" \")","v":"FC"},"AS",60513,"3048AS",304000,300001]
[60515,"AS","FC Academic Support","FC","AS",60515,"3048AS",304000,300001]
[60526,"ID","FC Instruction","FC","I",60526,"3017ID",301000,300001]
[60537,"SS","FC Student Services","FC","SS",60537,"3052SS",305000,300001]
[60551,"IN","FC Instruction","FC","I",60551,"3017IN",301000,300001]
[60561,"ID","FC Instruction","FC","I",60561,"3017ID",301000,300001]
[60579,"AS","FC Academic Support","FC","AS",60579,"3048AS",304000,300001]
[60590,"FA","FC Scholarships","FC","FA",60590,"3083FA",308000,300001]
[60596,"PS","FC Public Service","FC","PS",60596,"3030PS",303000,300001]
[60700,"AS","FC Academic Support","FC","AS",60700,"3043AS",304000,300001]
[60701,"PS","FC Public Service","FC","PS",60701,"3043PS",303000,300001]
[61000,"IN","FC Instruction","FC","I",61000,"3010IN",301000,300001]
[61001,"IN","FC Instruction","FC","I",61001,"3010IN",301000,300001]
[61002,"IN","FC Instruction","FC","I",61002,"3010IN",301000,300001]
[61003,"IN","FC Instruction","FC","I",61003,"3010IN",301000,300001]
[61004,"IN","FC Instruction","FC",{"$f":"IF(A1987<>\" \",VLOOKUP(B1987,NCHEMS_ABBR,3,0),\" \")","v":"I"},61004,"3010IN",301000,300001]
[61005,"IN","FC Instruction","FC","I",61005,"3010IN",301000,300001]
[61006,"IN","FC Instruction","FC","I",61006,"3010IN",301000,300001]
[61007,"IN","FC Instruction","FC","I",61007,"3010IN",301000,300001]
[61008,"IN","FC Instruction","FC","I",61008,"3010IN",301000,300001]
[61009,"RO","FC Research","FC","R",61009,"3010RO",302000,300001]
[61010,"IN","FC Instruction","FC","I",61010,"3010IN",301000,300001]
[61011,"IN","FC Instruction","FC","I",61011,"3010IN",301000,300001]
[61012,"IN","FC Instruction","FC","I",61012,"3010IN",301000,300001]
[61013,"IN","FC Instruction","FC","I",61013,"3010IN",301000,300001]
[61014,"IN","FC Instruction","FC","I",61014,"3010IN",301000,300001]
[61015,"IN","FC Instruction","FC","I",61015,"3010IN",301000,300001]
[61016,"IN","FC Instruction","FC","I",61016,"3010IN",301000,300001]
[61017,"ID","FC Instruction","FC","I",61017,"3010ID",301000,300001]
[61018,"IN","FC Instruction","FC","I",61018,"3010IN",301000,300001]
[61019,"IR","FC Instruction","FC","I",61019,"3010IR",301000,300001]
[61020,"RO","FC Research","FC","R",61020,"3010RO",302000,300001]
[61021,"IN","FC Instruction","FC","I",61021,"3010IN",301000,300001]
[61022,"RD","FC Research","FC","R",61022,"3010RD",302000,300001]
[61023,"AS","FC Academic Support","FC","AS",61023,"3041AS",304000,300001]
[61024,"IN","FC Instruction","FC","I",61024,"3016IN",301000,300001]
[61025,"AS","FC Academic Support","FC","AS",61025,"3042AS",304000,300001]
[61026,"IN","FC Instruction","FC","I",61026,"3011IN",301000,300001]
[61027,"ID","FC Instruction","FC","I",61027,"3011ID",301000,300001]
[61028,"IN","FC Instruction","FC","I",61028,"3011IN",301000,300001]
[61029,"IN","FC Instruction","FC","I",61029,"3011IN",301000,300001]
[61030,"IN","FC Instruction","FC","I",61030,"3011IN",301000,300001]
[61031,"IN","FC Instruction","FC","I",61031,"3011IN",301000,300001]
[61032,"IN","FC Instruction","FC","I",61032,"3011IN",301000,300001]
[61033,"IN","FC Instruction","FC","I",61033,"3010IN",301000,300001]
[61034,"IN","FC Instruction","FC","I",61034,"3010IN",301000,300001]
[61035,"IN","FC Instruction","FC","I",61035,"3010IN",301000,300001]
[61036,"IN","FC Instruction","FC","I",61036,"3010IN",301000,300001]
[61037,"IN","FC Instruction","FC","I",61037,"3010IN",301000,300001]
[61038,"IN","FC Instruction","FC","I",61038,"3010IN",301000,300001]
[61039,"IN","FC Instruction","FC","I",61039,"3010IN",301000,300001]
[61040,"IN","FC Instruction","FC","I",61040,"3010IN",301000,300001]
[61041,"IM","FC Instruction","FC","I",61041,"3010IM",301000,300001]
[61042,"IN","FC Instruction","FC","I",61042,"3010IN",301000,300001]
[61043,"IN","FC Instruction","FC","I",61043,"3010IN",301000,300001]
[61044,"IN","FC Instruction","FC","I",61044,"3010IN",301000,300001]
[61045,"PS","FC Public Service","FC","PS",61045,"3033PS",303000,300001]
[61046,"IR","FC Instruction","FC","I",61046,"301AIR",301000,300001]
[61047,"IR","FC Instruction","FC","I",61047,"301AIR",301000,300001]
[61048,"AS","FC Academic Support","FC","AS",61048,"3042AS",304000,300001]
[61049,"AS","FC Academic Support","FC","AS",61049,"3042AS",304000,300001]
[61050,"AS","FC Academic Support","FC","AS",61050,"3042AS",304000,300001]
[61051,"IN","FC Instruction","FC","I",61051,"3011IN",301000,300001]
[61052,"IN","FC Instruction","FC","I",61052,"3011IN",301000,300001]
[{"$f":"IF(F2036>0,VALUE(F2036),\" \")","v":61053},{"$f":"IF(A2036<>\" \",RIGHT(G2036,2),\" \")","v":"AS"},{"$f":"IF(A2036<>\" \",VLOOKUP(H2036,ALLOC_NCHEMS,2,0),\" \")","v":"FC Academic Support"},{"$f":"IF(A2036<>\" \",VLOOKUP(I2036,ALLOC,2,0),\" \")","v":"FC"},"AS",61053,"3042AS",304000,300001]
[61054,"AS","FC Academic Support","FC","AS",61054,"3042AS",304000,300001]
[61055,"FA","FC Scholarships","FC","FA",61055,"3088FA",308000,300001]
[61056,"IN","FC Instruction","FC","I",61056,"3011IN",301000,300001]
[61057,"ID","FC Instruction","FC","I",61057,"3011ID",301000,300001]
[61058,"IN","FC Instruction","FC","I",61058,"3011IN",301000,300001]
[61059,"ID","FC Instruction","FC","I",61059,"3011ID",301000,300001]
[61060,"IR","FC Instruction","FC","I",61060,"301CIR",301000,300001]
[61061,"ID","FC Instruction","FC","I",61061,"3011ID",301000,300001]
[61062,"IN","FC Instruction","FC","I",61062,"3011IN",301000,300001]
[61063,"IR","FC Instruction","FC","I",61063,"301CIR",301000,300001]
[61064,"IN","FC Instruction","FC","I",61064,"3011IN",301000,300001]
[61065,"AS","FC Academic Support","FC","AS",61065,"3042AS",304000,300001]
[61066,"IN","FC Instruction","FC","I",61066,"3011IN",301000,300001]
[61067,"RO","FC Research","FC","R",61067,"301CRO",302000,300001]
[61068,"ID","FC Instruction","FC",{"$f":"IF(A2051<>\" \",VLOOKUP(B2051,NCHEMS_ABBR,3,0),\" \")","v":"I"},61068,"3011ID",301000,300001]
[61069,"AS","FC Academic Support","FC","AS",61069,"3042AS",304000,300001]
[61070,"IN","FC Instruction","FC","I",61070,"3011IN",301000,300001]
[61071,"AS","FC Academic Support","FC","AS",61071,"3042AS",304000,300001]
[61072,"IN","FC Instruction","FC","I",61072,"3011IN",301000,300001]
[61073,"IN","FC Instruction","FC","I",61073,"3011IN",301000,300001]
[61074,"IN","FC Instruction","FC","I",61074,"3011IN",301000,300001]
[61075,"IN","FC Instruction","FC","I",61075,"3011IN",301000,300001]
[61076,"FA","FC Scholarships","FC","FA",61076,"3088FA",308000,300001]
[61077,"RO","FC Research","FC","R",61077,"301CRO",302000,300001]
[61078,"RO","FC Research","FC","R",61078,"3824RO",302000,300001]
[61079,"AS","FC Academic Support","FC","AS",61079,"3041AS",304000,300001]
[61080,"IN","FC Instruction","FC","I",61080,"3010IN",301000,300001]
[61081,"PD","FC Public Service","FC","PS",61081,"3032PD",303000,300001]
[61082,"PS","FC Public Service","FC","PS",61082,"3032PS",303000,300001]
[61083,"PS","FC Public Service","FC","PS",61083,"3032PS",303000,300001]
[61084,"PS","FC Public Service","FC","PS",61084,"3032PS",303000,300001]
[61085,"PS","FC Public Service","FC","PS",61085,"3032PS",303000,300001]
[61086,"IN","FC Instruction","FC","I",61086,"3010IN",301000,300001]
[61087,"IN","FC Instruction","FC","I",61087,"3010IN",301000,300001]
[61088,"PS","FC Public Service","FC","PS",61088,"3033PS",303000,300001]
[61089,"PS","FC Public Service","FC","PS",61089,"3033PS",303000,300001]
[61090,"PS","FC Public Service","FC","PS",61090,"3033PS",303000,300001]
[61091,"PS","FC Public Service","FC","PS",61091,"3033PS",303000,300001]
[61092,"PS","FC Public Service","FC","PS",61092,"3033PS",303000,300001]
[61093,"PS","FC Public Service","FC","PS",61093,"3033PS",303000,300001]
[61094,"PS","FC Public Service","FC","PS",61094,"3033PS",303000,300001]
[61095,"PS","FC Public Service","FC","PS",61095,"3033PS",303000,300001]
[61096,"PS","FC Public Service","FC","PS",61096,"3033PS",303000,300001]
[61097,"PS","FC Public Service","FC","PS",61097,"3033PS",303000,300001]
[61098,"PS","FC Public Service","FC","PS",61098,"3033PS",303000,300001]
[61099,"RO","FC Research","FC","R",61099,"3010RO",302000,300001]
[61100,"ID","FC Instruction","FC","I",61100,"3011ID",301000,300001]
[61101,"FA","FC Scholarships","FC","FA",61101,"3088FA",308000,300001]
[61102,"FA","FC Scholarships","FC","FA",61102,"3088FA",308000,300001]
[61103,"FA","FC Scholarships","FC","FA",61103,"3088FA",308000,300001]
[61104,"RO","FC Research","FC","R",61104,"3824RO",302000,300001]
[61105,"FA","FC Scholarships","FC","FA",61105,"3088FA",308000,300001]
[61106,"FA","FC Scholarships","FC","FA",61106,"3088FA",308000,300001]
[61107,"RT","FC Research","FC","R",61107,"3021RT",302000,300001]
[61108,"IN","FC Instruction","FC","I",61108,"3011IN",301000,300001]
[61109,"IN","FC Instruction","FC","I",61109,"3011IN",301000,300001]
[61110,"ID","FC Instruction","FC","I",61110,"3010ID",301000,300001]
[61111,"ID","FC Instruction","FC","I",61111,"3010ID",301000,300001]
[61112,"ID","FC Instruction","FC","I",61112,"3010ID",301000,300001]
[61113,"ID","FC Instruction","FC","I",61113,"3010ID",301000,300001]
[61114,"ID","FC Instruction","FC","I",61114,"3010ID",301000,300001]
[61115,"ID","FC Instruction","FC","I",61115,"3010ID",301000,300001]
[61116,"ID","FC Instruction","FC","I",61116,"3010ID",301000,300001]
[{"$f":"IF(F2100>0,VALUE(F2100),\" \")","v":61117},{"$f":"IF(A2100<>\" \",RIGHT(G2100,2),\" \")","v":"PS"},{"$f":"IF(A2100<>\" \",VLOOKUP(H2100,ALLOC_NCHEMS,2,0),\" \")","v":"FC Public Service"},{"$f":"IF(A2100<>\" \",VLOOKUP(I2100,ALLOC,2,0),\" \")","v":"FC"},"PS",61117,"3033PS",303000,300001]
[61118,"AS","FC Academic Support","FC","AS",61118,"3041AS",304000,300001]
[61119,"ID","FC Instruction","FC","I",61119,"3010ID",301000,300001]
[61120,"PS","FC Public Service","FC","PS",61120,"3033PS",303000,300001]
[61121,"ID","FC Instruction","FC","I",61121,"3010ID",301000,300001]
[61122,"ID","FC Instruction","FC","I",61122,"3010ID",301000,300001]
[61123,"ID","FC Instruction","FC","I",61123,"3010ID",301000,300001]
[61124,"ID","FC Instruction","FC","I",61124,"3010ID",301000,300001]
[61125,"PS","FC Public Service","FC","PS",61125,"3033PS",303000,300001]
[61126,"ID","FC Instruction","FC","I",61126,"3010ID",301000,300001]
[61127,"PS","FC Public Service","FC","PS",61127,"303DPS",303000,300001]
[61128,"ID","FC Instruction","FC","I",61128,"3011ID",301000,300001]
[61130,"AS","FC Academic Support","FC","AS",61130,"3042AS",304000,300001]
[61131,"IN","FC Instruction","FC","I",61131,"3011IN",301000,300001]
[61132,"AS","FC Academic Support","FC","AS",61132,"3042AS",304000,300001]
[61133,"ID","FC Instruction","FC",{"$f":"IF(A2115<>\" \",VLOOKUP(B2115,NCHEMS_ABBR,3,0),\" \")","v":"I"},61133,"3010ID",301000,300001]
[61134,"ID","FC Instruction","FC","I",61134,"3010ID",301000,300001]
[61135,"ID","FC Instruction","FC","I",61135,"3010ID",301000,300001]
[61136,"ID","FC Instruction","FC","I",61136,"3010ID",301000,300001]
[61137,"ID","FC Instruction","FC","I",61137,"3010ID",301000,300001]
[61138,"ID","FC Instruction","FC","I",61138,"3010ID",301000,300001]
[61139,"ID","FC Instruction","FC","I",61139,"3010ID",301000,300001]
[61140,"ID","FC Instruction","FC","I",61140,"3010ID",301000,300001]
[61141,"IN","FC Instruction","FC","I",61141,"3010IN",301000,300001]
[61142,"ID","FC Instruction","FC","I",61142,"3010ID",301000,300001]
[61143,"IN","FC Instruction","FC","I",61143,"3010IN",301000,300001]
[61144,"ID","FC Instruction","FC","I",61144,"3010ID",301000,300001]
[61145,"ID","FC Instruction","FC","I",61145,"3010ID",301000,300001]
[61146,"RO","FOR Research","FOR","R",61146,"382ERO",382000,300002]
[61147,"ID","FC Instruction","FC","I",61147,"3010ID",301000,300001]
[61148,"PS","FC Public Service","FC","PS",61148,"3033PS",303000,300001]
[61149,"IN","FC Instruction","FC","I",61149,"3010IN",301000,300001]
[61150,"PS","FC Public Service","FC","PS",61150,"3033PS",303000,300001]
[61151,"ID","FC Instruction","FC","I",61151,"301AID",301000,300001]
[61152,"PS","FC Public Service","FC","PS",61152,"303CPS",303000,300001]
[61153,"ID","FC Instruction","FC","I",61153,"3010ID",301000,300001]
[61154,"IR","FC Instruction","FC","I",61154,"3010IR",301000,300001]
[61155,"IR","FC Instruction","FC","I",61155,"3010IR",301000,300001]
[61156,"IR","FC Instruction","FC","I",61156,"3010IR",301000,300001]
[61157,"RO","FC Research","FC","R",61157,"301ARO",302000,300001]
[61158,"ID","FC Instruction","FC","I",61158,"3010ID",301000,300001]
[61159,"PS","FC Public Service","FC","PS",61159,"3033PS",303000,300001]
[61160,"PS","FC Public Service","FC","PS",61160,"303CPS",303000,300001]
[61161,"IN","FC Instruction","FC","I",61161,"3010IN",301000,300001]
[61162,"ID","FC Instruction","FC","I",61162,"3010ID",301000,300001]
[61163,"IN","FC Instruction","FC","I",61163,"3010IN",301000,300001]
[61164,"ID","FC Instruction","FC","I",61164,"3010ID",301000,300001]
[61165,"IN","FC Instruction","FC","I",61165,"3010IN",301000,300001]
[61166,"ID","FC Instruction","FC","I",61166,"3010ID",301000,300001]
[61167,"ID","FC Instruction","FC","I",61167,"3010ID",301000,300001]
[61168,"PS","FC Public Service","FC","PS",61168,"3033PS",303000,300001]
[61169,"IN","FC Instruction","FC","I",61169,"3010IN",301000,300001]
[61170,"ID","FC Instruction","FC","I",61170,"3010ID",301000,300001]
[61171,"IM","FC Instruction","FC","I",61171,"3010IM",301000,300001]
[61172,"AS","FC Academic Support","FC","AS",61172,"3041AS",304000,300001]
[61173,"PD","FC Public Service","FC","PS",61173,"303CPD",303000,300001]
[61174,"PS","FC Public Service","FC","PS",61174,"3033PS",303000,300001]
[61175,"ID","FC Instruction","FC","I",61175,"3010ID",301000,300001]
[61176,"PD","FC Public Service","FC","PS",61176,"3033PD",303000,300001]
[61177,"IN","FC Instruction","FC","I",61177,"3010IN",301000,300001]
[61178,"ID","FC Instruction","FC","I",61178,"3010ID",301000,300001]
[61179,"AS","FC Academic Support","FC","AS",61179,"3041AS",304000,300001]
[61180,"IN","FC Instruction","FC","I",61180,"3010IN",301000,300001]
[61181,"AS","FC Academic Support","FC","AS",61181,"3041AS",304000,300001]
[{"$f":"IF(F2164>0,VALUE(F2164),\" \")","v":61182},{"$f":"IF(A2164<>\" \",RIGHT(G2164,2),\" \")","v":"IN"},{"$f":"IF(A2164<>\" \",VLOOKUP(H2164,ALLOC_NCHEMS,2,0),\" \")","v":"FC Instruction"},{"$f":"IF(A2164<>\" \",VLOOKUP(I2164,ALLOC,2,0),\" \")","v":"FC"},"I",61182,"3010IN",301000,300001]
[61183,"AS","FC Academic Support","FC","AS",61183,"3041AS",304000,300001]
[61184,"ID","FC Instruction","FC","I",61184,"3010ID",301000,300001]
[61185,"PD","FC Public Service","FC","PS",61185,"3033PD",303000,300001]
[61186,"PD","FC Public Service","FC","PS",61186,"3033PD",303000,300001]
[61187,"ID","FC Instruction","FC","I",61187,"3010ID",301000,300001]
[61188,"IR","FC Instruction","FC","I",61188,"3010IR",301000,300001]
[61189,"IR","FC Instruction","FC","I",61189,"3010IR",301000,300001]
[61190,"IR","FC Instruction","FC","I",61190,"3010IR",301000,300001]
[61191,"PS","FC Public Service","FC","PS",61191,"3033PS",303000,300001]
[61192,"IR","FC Instruction","FC","I",61192,"3010IR",301000,300001]
[61193,"IR","FC Instruction","FC","I",61193,"3010IR",301000,300001]
[61194,"IR","FC Instruction","FC","I",61194,"3010IR",301000,300001]
[61195,"RT","FC Research","FC","R",61195,"3010RT",302000,300001]
[61196,"FA","FC Scholarships","FC","FA",61196,"3010FA",308000,300001]
[61197,"FA","FC Scholarships","FC",{"$f":"IF(A2179<>\" \",VLOOKUP(B2179,NCHEMS_ABBR,3,0),\" \")","v":"FA"},61197,"3010FA",308000,300001]
[61198,"FA","FC Scholarships","FC","FA",61198,"3010FA",308000,300001]
[61199,"FA","FC Scholarships","FC","FA",61199,"3010FA",308000,300001]
[61200,"RO","FC Research","FC","R",61200,"3010RO",302000,300001]
[61201,"RO","FC Research","FC","R",61201,"3010RO",302000,300001]
[61203,"RO","FC Research","FC","R",61203,"3010RO",302000,300001]
[61204,"RO","FC Research","FC","R",61204,"3010RO",302000,300001]
[61206,"RO","FC Research","FC","R",61206,"3010RO",302000,300001]
[61208,"FA","FC Scholarships","FC","FA",61208,"3010FA",308000,300001]
[61214,"RO","FC Research","FC","R",61214,"3010RO",302000,300001]
[61215,"RO","FC Research","FC","R",61215,"3010RO",302000,300001]
[61216,"RO","FC Research","FC","R",61216,"3010RO",302000,300001]
[61217,"RO","FC Research","FC","R",61217,"3010RO",302000,300001]
[61218,"RO","FC Research","FC","R",61218,"3010RO",302000,300001]
[61222,"RO","FC Research","FC","R",61222,"3010RO",302000,300001]
[61223,"IR","FC Instruction","FC","I",61223,"3010IR",301000,300001]
[61224,"PS","FC Public Service","FC","PS",61224,"3033PS",303000,300001]
[61225,"PS","FC Public Service","FC","PS",61225,"3033PS",303000,300001]
[61226,"PS","FC Public Service","FC","PS",61226,"3033PS",303000,300001]
[61227,"PS","FC Public Service","FC","PS",61227,"3033PS",303000,300001]
[61228,"IR","FC Instruction","FC","I",61228,"3010IR",301000,300001]
[61229,"PS","FC Public Service","FC","PS",61229,"3033PS",303000,300001]
[61232,"IN","FC Instruction","FC","I",61232,"3010IN",301000,300001]
[61233,"RO","FC Research","FC","R",61233,"3010RO",302000,300001]
[61235,"RO","FC Research","FC","R",61235,"3010RO",302000,300001]
[61236,"RO","FC Research","FC","R",61236,"3010RO",302000,300001]
[61238,"RO","FC Research","FC","R",61238,"3010RO",302000,300001]
[61240,"RO","FC Research","FC","R",61240,"3010RO",302000,300001]
[61243,"ID","FC Instruction","FC","I",61243,"3010ID",301000,300001]
[61244,"RO","FC Research","FC","R",61244,"3010RO",302000,300001]
[61245,"RO","FC Research","FC","R",61245,"3010RO",302000,300001]
[61246,"RO","FOR Research","FOR","R",61246,"382ERO",382000,300002]
[61247,"PS","FC Public Service","FC","PS",61247,"3033PS",303000,300001]
[61248,"IN","FC Instruction","FC","I",61248,"3010IN",301000,300001]
[61249,"ID","FC Instruction","FC","I",61249,"3010ID",301000,300001]
[61250,"IN","FC Instruction","FC","I",61250,"3010IN",301000,300001]
[61251,"ID","FC Instruction","FC","I",61251,"3010ID",301000,300001]
[61252,"IR","FC Instruction","FC","I",61252,"3010IR",301000,300001]
[61253,"IR","FC Instruction","FC","I",61253,"301BIR",301000,300001]
[61254,"ID","FC Instruction","FC","I",61254,"3010ID",301000,300001]
[61255,"RO","FC Research","FC","R",61255,"301ARO",302000,300001]
[61256,"IR","FC Instruction","FC","I",61256,"3010IR",301000,300001]
[61257,"IR","FC Instruction","FC","I",61257,"3010IR",301000,300001]
[61258,"IR","FC Instruction","FC","I",61258,"3010IR",301000,300001]
[61259,"IR","FC Instruction","FC","I",61259,"3010IR",301000,300001]
[61260,"PS","FC Public Service","FC","PS",61260,"3032PS",303000,300001]
[61261,"PS","FC Public Service","FC","PS",61261,"3032PS",303000,300001]
[61262,"PS","FC Public Service","FC","PS",61262,"3032PS",303000,300001]
[61263,"PS","FC Public Service","FC","PS",61263,"3032PS",303000,300001]
[{"$f":"IF(F2228>0,VALUE(F2228),\" \")","v":61264},{"$f":"IF(A2228<>\" \",RIGHT(G2228,2),\" \")","v":"PZ"},{"$f":"IF(A2228<>\" \",VLOOKUP(H2228,ALLOC_NCHEMS,2,0),\" \")","v":"FC Public Service"},{"$f":"IF(A2228<>\" \",VLOOKUP(I2228,ALLOC,2,0),\" \")","v":"FC"},"PS",61264,"3032PZ",303000,300001]
[61265,"PZ","FC Public Service","FC","PS",61265,"3032PZ",303000,300001]
[61266,"PZ","FC Public Service","FC","PS",61266,"3032PZ",303000,300001]
[61267,"PZ","FC Public Service","FC","PS",61267,"3032PZ",303000,300001]
[61268,"PS","FC Public Service","FC","PS",61268,"3032PS",303000,300001]
[61269,"PS","FC Public Service","FC","PS",61269,"3032PS",303000,300001]
[61270,"PS","FC Public Service","FC","PS",61270,"3032PS",303000,300001]
[61271,"PS","FC Public Service","FC","PS",61271,"3032PS",303000,300001]
[61272,"PS","FC Public Service","FC","PS",61272,"3032PS",303000,300001]
[61273,"PZ","FC Public Service","FC","PS",61273,"3032PZ",303000,300001]
[61280,"PS","FC Public Service","FC","PS",61280,"3032PS",303000,300001]
[61281,"PS","FC Public Service","FC","PS",61281,"3032PS",303000,300001]
[61282,"PS","FC Public Service","FC","PS",61282,"3032PS",303000,300001]
[61283,"PS","FC Public Service","FC","PS",61283,"3032PS",303000,300001]
[61284,"PZ","FC Public Service","FC","PS",61284,"3032PZ",303000,300001]
[61285,"PZ","FC Public Service","FC",{"$f":"IF(A2243<>\" \",VLOOKUP(B2243,NCHEMS_ABBR,3,0),\" \")","v":"PS"},61285,"3032PZ",303000,300001]
[61286,"PZ","FC Public Service","FC","PS",61286,"3032PZ",303000,300001]
[61287,"PZ","FC Public Service","FC","PS",61287,"3032PZ",303000,300001]
[61288,"PS","FC Public Service","FC","PS",61288,"3032PS",303000,300001]
[61289,"PS","FC Public Service","FC","PS",61289,"3032PS",303000,300001]
[61290,"PS","FC Public Service","FC","PS",61290,"3032PS",303000,300001]
[61291,"PS","FC Public Service","FC","PS",61291,"3032PS",303000,300001]
[61292,"PS","FC Public Service","FC","PS",61292,"3032PS",303000,300001]
[61293,"PZ","FC Public Service","FC","PS",61293,"3032PZ",303000,300001]
[61294,"PS","FC Public Service","FC","PS",61294,"3032PS",303000,300001]
[61295,"PS","FC Public Service","FC","PS",61295,"3032PS",303000,300001]
[61296,"PS","FC Public Service","FC","PS",61296,"3032PS",303000,300001]
[61297,"PS","FC Public Service","FC","PS",61297,"3032PS",303000,300001]
[62000,"RR","FOR Research","FOR","R",62000,"3921RR",382000,300002]
[62001,"RR","FOR Research","FOR","R",62001,"3921RR",382000,300002]
[62002,"RR","FOR Research","FOR","R",62002,"3921RR",382000,300002]
[62003,"RR","FOR Research","FOR","R",62003,"3921RR",382000,300002]
[62004,"RR","FOR Research","FOR","R",62004,"3921RR",382000,300002]
[62005,"RR","FOR Research","FOR","R",62005,"3921RR",382000,300002]
[62006,"RR","FOR Research","FOR","R",62006,"3921RR",382000,300002]
[62007,"RR","FOR Research","FOR","R",62007,"3921RR",382000,300002]
[62008,"RR","FOR Research","FOR","R",62008,"3921RR",382000,300002]
[62009,"OM","FC Physical Plant","FC","PP",62009,"3970OM",307000,300001]
[62010,"RR","FOR Research","FOR","R",62010,"3921RR",382000,300002]
[62011,"RR","FOR Research","FOR","R",62011,"3921RR",382000,300002]
[62012,"RY","FOR Research","FOR","R",62012,"3921RY",382000,300002]
[62013,"RD","FOR Research","FOR","R",62013,"3920RD",382000,300002]
[62014,"RD","FOR Research","FOR","R",62014,"3920RD",382000,300002]
[62015,"RD","FOR Research","FOR","R",62015,"3920RD",382000,300002]
[62016,"RD","FOR Research","FOR","R",62016,"3960RD",382000,300002]
[62017,"RR","FOR Research","FOR","R",62017,"3920RR",382000,300002]
[62018,"OR","FC Physical Plant","FC",{"$error":"#N/A"},62018,"3970OR",307000,300001]
[62019,"IN","FC Instruction","FC","I",62019,"3910IN",301000,300001]
[62020,"RR","FOR Research","FOR","R",62020,"3920RR",382000,300002]
[62021,"RR","FOR Research","FOR","R",62021,"3920RR",382000,300002]
[62022,"RD","FOR Research","FOR","R",62022,"3960RD",382000,300002]
[62023,"PR","FC Public Service","FC",{"$error":"#N/A"},62023,"3930PR",303000,300001]
[62024,"OR","FC Physical Plant","FC",{"$error":"#N/A"},62024,"3976OR",307000,300001]
[62025,"RR","FOR Research","FOR","R",62025,"3920RR",382000,300002]
[62026,"OR","FC Physical Plant","FC",{"$error":"#N/A"},62026,"3976OR",307000,300001]
[62027,"OR","FC Physical Plant","FC",{"$error":"#N/A"},62027,"3976OR",307000,300001]
[62028,"RR","FOR Research","FOR","R",62028,"3920RR",382000,300002]
[62029,"RR","FOR Research","FOR","R",62029,"3920RR",382000,300002]
[62030,"RY","FOR Research","FOR","R",62030,"3960RY",382000,300002]
[62031,"RR","FOR Research","FOR","R",62031,"3920RR",382000,300002]
[62032,"RR","FOR Research","FOR","R",62032,"3920RR",382000,300002]
[62033,"RR","FOR Research","FOR","R",62033,"3920RR",382000,300002]
[62034,"RR","FOR Research","FOR","R",62034,"3920RR",382000,300002]
[62035,"RY","FOR Research","FOR","R",62035,"3960RY",382000,300002]
[{"$f":"IF(F2292>0,VALUE(F2292),\" \")","v":62036},{"$f":"IF(A2292<>\" \",RIGHT(G2292,2),\" \")","v":"RR"},{"$f":"IF(A2292<>\" \",VLOOKUP(H2292,ALLOC_NCHEMS,2,0),\" \")","v":"FOR Research"},{"$f":"IF(A2292<>\" \",VLOOKUP(I2292,ALLOC,2,0),\" \")","v":"FOR"},"R",62036,"3920RR",382000,300002]
[62037,"RR","FOR Research","FOR","R",62037,"3920RR",382000,300002]
[62038,"RR","FOR Research","FOR","R",62038,"3920RR",382000,300002]
[62039,"RR","FOR Research","FOR","R",62039,"3920RR",382000,300002]
[62040,"RR","FOR Research","FOR","R",62040,"3920RR",382000,300002]
[62041,"RR","FOR Research","FOR","R",62041,"3920RR",382000,300002]
[62042,"RR","FOR Research","FOR","R",62042,"3920RR",382000,300002]
[62043,"RR","FOR Research","FOR","R",62043,"3920RR",382000,300002]
[62044,"RR","FOR Research","FOR","R",62044,"3920RR",382000,300002]
[62045,"RR","FOR Research","FOR","R",62045,"3920RR",382000,300002]
[62046,"RR","FOR Research","FOR","R",62046,"3920RR",382000,300002]
[62047,"RR","FOR Research","FOR","R",62047,"3920RR",382000,300002]
[62048,"RR","FOR Research","FOR","R",62048,"3920RR",382000,300002]
[62049,"RR","FOR Research","FOR","R",62049,"3920RR",382000,300002]
[62050,"RR","FOR Research","FOR","R",62050,"3920RR",382000,300002]
[62051,"RR","FOR Research","FOR",{"$f":"IF(A2307<>\" \",VLOOKUP(B2307,NCHEMS_ABBR,3,0),\" \")","v":"R"},62051,"3920RR",382000,300002]
[62052,"RR","FOR Research","FOR","R",62052,"3920RR",382000,300002]
[62053,"RR","FOR Research","FOR","R",62053,"3920RR",382000,300002]
[62054,"PS","FOR Public Service","FOR","PS",62054,"3830PS",383000,300002]
[62055,"RR","FOR Research","FOR","R",62055,"3920RR",382000,300002]
[62056,"RR","FOR Research","FOR","R",62056,"3920RR",382000,300002]
[62057,"RR","FOR Research","FOR","R",62057,"3920RR",382000,300002]
[62058,"RR","FOR Research","FOR","R",62058,"3920RR",382000,300002]
[62059,"RR","FOR Research","FOR","R",62059,"3920RR",382000,300002]
[62060,"RR","FOR Research","FOR","R",62060,"3920RR",382000,300002]
[62061,"RR","FOR Research","FOR","R",62061,"3920RR",382000,300002]
[62062,"RR","FOR Research","FOR","R",62062,"3920RR",382000,300002]
[62063,"RR","FOR Research","FOR","R",62063,"3920RR",382000,300002]
[62064,"RR","FOR Research","FOR","R",62064,"3922RR",382000,300002]
[62065,"RR","FOR Research","FOR","R",62065,"3920RR",382000,300002]
[62066,"RR","FOR Research","FOR","R",62066,"3920RR",382000,300002]
[62067,"RR","FOR Research","FOR","R",62067,"3920RR",382000,300002]
[62068,"RR","FOR Research","FOR","R",62068,"3920RR",382000,300002]
[62069,"RR","FOR Research","FOR","R",62069,"3920RR",382000,300002]
[62070,"RR","FOR Research","FOR","R",62070,"3920RR",382000,300002]
[62071,"RR","FOR Research","FOR","R",62071,"3920RR",382000,300002]
[62072,"RR","FOR Research","FOR","R",62072,"3920RR",382000,300002]
[62073,"RR","FOR Research","FOR","R",62073,"3920RR",382000,300002]
[62074,"RR","FOR Research","FOR","R",62074,"3920RR",382000,300002]
[62075,"RR","FOR Research","FOR","R",62075,"3920RR",382000,300002]
[62076,"RR","FOR Research","FOR","R",62076,"3921RR",382000,300002]
[62077,"RR","FOR Research","FOR","R",62077,"3920RR",382000,300002]
[62078,"RR","FOR Research","FOR","R",62078,"3920RR",382000,300002]
[62079,"RR","FOR Research","FOR","R",62079,"3920RR",382000,300002]
[62080,"RR","FOR Research","FOR","R",62080,"3920RR",382000,300002]
[62081,"RR","FOR Research","FOR","R",62081,"3920RR",382000,300002]
[62082,"RR","FOR Research","FOR","R",62082,"3920RR",382000,300002]
[62083,"RR","FOR Research","FOR","R",62083,"3920RR",382000,300002]
[62084,"RR","FOR Research","FOR","R",62084,"3920RR",382000,300002]
[62085,"RR","FOR Research","FOR","R",62085,"3920RR",382000,300002]
[62086,"RR","FOR Research","FOR","R",62086,"3920RR",382000,300002]
[62087,"PS","FOR Public Service","FOR","PS",62087,"3830PS",383000,300002]
[62088,"RR","FOR Research","FOR","R",62088,"3920RR",382000,300002]
[62089,"RR","FOR Research","FOR","R",62089,"3920RR",382000,300002]
[62090,"PS","FC Public Service","FC","PS",62090,"3930PS",303000,300001]
[62091,"GR","FC Institutional Support","FC",{"$error":"#N/A"},62091,"3960GR",306000,300001]
[62092,"GR","FC Institutional Support","FC",{"$error":"#N/A"},62092,"3960GR",306000,300001]
[62093,"GR","FC Institutional Support","FC",{"$error":"#N/A"},62093,"3960GR",306000,300001]
[62094,"OR","FC Physical Plant","FC",{"$error":"#N/A"},62094,"3976OR",307000,300001]
[62095,"RR","FOR Research","FOR","R",62095,"3922RR",382000,300002]
[62096,"RR","FOR Research","FOR","R",62096,"3922RR",382000,300002]
[62097,"RR","FOR Research","FOR","R",62097,"3922RR",382000,300002]
[62098,"RR","FOR Research","FOR","R",62098,"3922RR",382000,300002]
[62099,"RR","FOR Research","FOR","R",62099,"3922RR",382000,300002]
[{"$f":"IF(F2356>0,VALUE(F2356),\" \")","v":62100},{"$f":"IF(A2356<>\" \",RIGHT(G2356,2),\" \")","v":"RR"},{"$f":"IF(A2356<>\" \",VLOOKUP(H2356,ALLOC_NCHEMS,2,0),\" \")","v":"FOR Research"},{"$f":"IF(A2356<>\" \",VLOOKUP(I2356,ALLOC,2,0),\" \")","v":"FOR"},"R",62100,"3922RR",382000,300002]
[62101,"RR","FOR Research","FOR","R",62101,"3922RR",382000,300002]
[62102,"RR","FOR Research","FOR","R",62102,"3922RR",382000,300002]
[62103,"RR","FOR Research","FOR","R",62103,"3922RR",382000,300002]
[62104,"RR","FOR Research","FOR","R",62104,"3922RR",382000,300002]
[62105,"RR","FOR Research","FOR","R",62105,"3922RR",382000,300002]
[62106,"RR","FOR Research","FOR","R",62106,"3922RR",382000,300002]
[62107,"RR","FOR Research","FOR","R",62107,"3922RR",382000,300002]
[62108,"RR","FOR Research","FOR","R",62108,"3922RR",382000,300002]
[62109,"RR","FOR Research","FOR","R",62109,"3922RR",382000,300002]
[62110,"RR","FOR Research","FOR","R",62110,"3922RR",382000,300002]
[62111,"RR","FOR Research","FOR","R",62111,"3922RR",382000,300002]
[62112,"RR","FOR Research","FOR","R",62112,"3922RR",382000,300002]
[62113,"RR","FOR Research","FOR","R",62113,"3922RR",382000,300002]
[62114,"RR","FOR Research","FOR","R",62114,"3922RR",382000,300002]
[62115,"RD","FOR Research","FOR",{"$f":"IF(A2371<>\" \",VLOOKUP(B2371,NCHEMS_ABBR,3,0),\" \")","v":"R"},62115,"3920RD",382000,300002]
[62116,"RR","FOR Research","FOR","R",62116,"3922RR",382000,300002]
[62117,"RY","FOR Research","FOR","R",62117,"3960RY",382000,300002]
[62118,"PS","FC Public Service","FC","PS",62118,"3930PS",303000,300001]
[62119,"RR","FOR Research","FOR","R",62119,"3924RR",382000,300002]
[62120,"RR","FOR Research","FOR","R",62120,"3924RR",382000,300002]
[62121,"PS","FC Public Service","FC","PS",62121,"3930PS",303000,300001]
[62122,"PS","FC Public Service","FC","PS",62122,"3930PS",303000,300001]
[62123,"RR","FOR Research","FOR","R",62123,"3924RR",382000,300002]
[62124,"PS","FC Public Service","FC","PS",62124,"3930PS",303000,300001]
[62125,"RR","FOR Research","FOR","R",62125,"3924RR",382000,300002]
[62126,"PR","FC Public Service","FC",{"$error":"#N/A"},62126,"3931PR",303000,300001]
[62127,"PR","FC Public Service","FC",{"$error":"#N/A"},62127,"3931PR",303000,300001]
[62128,"PR","FC Public Service","FC",{"$error":"#N/A"},62128,"3931PR",303000,300001]
[62129,"RR","FOR Research","FOR","R",62129,"3920RR",382000,300002]
[62130,"RR","FOR Research","FOR","R",62130,"3924RR",382000,300002]
[62131,"RR","FOR Research","FOR","R",62131,"3924RR",382000,300002]
[62132,"RR","FOR Research","FOR","R",62132,"3924RR",382000,300002]
[62133,"PR","FC Public Service","FC",{"$error":"#N/A"},62133,"3931PR",303000,300001]
[62134,"PR","FC Public Service","FC",{"$error":"#N/A"},62134,"3931PR",303000,300001]
[62135,"GR","FC Institutional Support","FC",{"$error":"#N/A"},62135,"3960GR",306000,300001]
[62136,"GR","FC Institutional Support","FC",{"$error":"#N/A"},62136,"3960GR",306000,300001]
[62137,"OR","FC Physical Plant","FC",{"$error":"#N/A"},62137,"3974OR",307000,300001]
[62138,"AS","FC Academic Support","FC","AS",62138,"3940AS",304000,300001]
[62139,"IN","FC Instruction","FC","I",62139,"3910IN",301000,300001]
[62140,"IN","FC Instruction","FC","I",62140,"3910IN",301000,300001]
[62141,"RD","FOR Research","FOR","R",62141,"3960RD",382000,300002]
[62142,"AS","FC Academic Support","FC","AS",62142,"3940AS",304000,300001]
[62143,"RD","FOR Research","FOR","R",62143,"3920RD",382000,300002]
[62144,"RD","FOR Research","FOR","R",62144,"3960RD",382000,300002]
[62145,"AS","FC Academic Support","FC","AS",62145,"3960AS",304000,300001]
[62146,"PD","FC Public Service","FC","PS",62146,"3930PD",303000,300001]
[62147,"RD","FOR Research","FOR","R",62147,"3920RD",382000,300002]
[62148,"OR","FC Physical Plant","FC",{"$error":"#N/A"},62148,"3976OR",307000,300001]
[62149,"OR","FC Physical Plant","FC",{"$error":"#N/A"},62149,"3976OR",307000,300001]
[62150,"PR","FC Public Service","FC",{"$error":"#N/A"},62150,"3932PR",303000,300001]
[62151,"PR","FC Public Service","FC",{"$error":"#N/A"},62151,"3932PR",303000,300001]
[62152,"PR","FC Public Service","FC",{"$error":"#N/A"},62152,"3932PR",303000,300001]
[62153,"PR","FC Public Service","FC",{"$error":"#N/A"},62153,"3932PR",303000,300001]
[62154,"RR","FOR Research","FOR","R",62154,"3920RR",382000,300002]
[62155,"RR","FOR Research","FOR","R",62155,"3924RR",382000,300002]
[62156,"RR","FOR Research","FOR","R",62156,"3924RR",382000,300002]
[62157,"AR","FC Academic Support","FC",{"$error":"#N/A"},62157,"3940AR",304000,300001]
[62158,"AR","FC Academic Support","FC",{"$error":"#N/A"},62158,"3940AR",304000,300001]
[62159,"AR","FC Academic Support","FC",{"$error":"#N/A"},62159,"3940AR",304000,300001]
[62160,"AR","FC Academic Support","FC",{"$error":"#N/A"},62160,"3940AR",304000,300001]
[62161,"GR","FC Institutional Support","FC",{"$error":"#N/A"},62161,"3960GR",306000,300001]
[62162,"AR","FC Academic Support","FC",{"$error":"#N/A"},62162,"3940AR",304000,300001]
[62163,"AR","FC Academic Support","FC",{"$error":"#N/A"},62163,"3940AR",304000,300001]
[{"$f":"IF(F2420>0,VALUE(F2420),\" \")","v":62164},{"$f":"IF(A2420<>\" \",RIGHT(G2420,2),\" \")","v":"GR"},{"$f":"IF(A2420<>\" \",VLOOKUP(H2420,ALLOC_NCHEMS,2,0),\" \")","v":"FC Institutional Support"},{"$f":"IF(A2420<>\" \",VLOOKUP(I2420,ALLOC,2,0),\" \")","v":"FC"},{"$error":"#N/A"},62164,"3960GR",306000,300001]
[62165,"GR","FC Institutional Support","FC",{"$error":"#N/A"},62165,"3960GR",306000,300001]
[62166,"AR","FC Academic Support","FC",{"$error":"#N/A"},62166,"3940AR",304000,300001]
[62167,"AR","FC Academic Support","FC",{"$error":"#N/A"},62167,"3941AR",304000,300001]
[62168,"OR","FC Physical Plant","FC",{"$error":"#N/A"},62168,"3971OR",307000,300001]
[62169,"OR","FC Physical Plant","FC",{"$error":"#N/A"},62169,"3970OR",307000,300001]
[62170,"OR","FC Physical Plant","FC",{"$error":"#N/A"},62170,"3976OR",307000,300001]
[62171,"IR","FC Instruction","FC","I",62171,"3910IR",301000,300001]
[62172,"IR","FC Instruction","FC","I",62172,"3910IR",301000,300001]
[62173,"IR","FC Instruction","FC","I",62173,"3910IR",301000,300001]
[62174,"IR","FC Instruction","FC","I",62174,"3910IR",301000,300001]
[62175,"IR","FC Instruction","FC","I",62175,"3912IR",301000,300001]
[62176,"IR","FC Instruction","FC","I",62176,"3912IR",301000,300001]
[62177,"IR","FC Instruction","FC","I",62177,"3911IR",301000,300001]
[62178,"IR","FC Instruction","FC","I",62178,"3911IR",301000,300001]
[62179,"IN","FC Instruction","FC",{"$f":"IF(A2435<>\" \",VLOOKUP(B2435,NCHEMS_ABBR,3,0),\" \")","v":"I"},62179,"3910IN",301000,300001]
[62180,"IR","FC Instruction","FC","I",62180,"3912IR",301000,300001]
[62181,"IR","FC Instruction","FC","I",62181,"3912IR",301000,300001]
[62182,"IR","FC Instruction","FC","I",62182,"3912IR",301000,300001]
[62183,"RR","FOR Research","FOR","R",62183,"3923RR",382000,300002]
[62184,"RR","FOR Research","FOR","R",62184,"3923RR",382000,300002]
[62185,"RR","FOR Research","FOR","R",62185,"3923RR",382000,300002]
[62186,"RR","FOR Research","FOR","R",62186,"3923RR",382000,300002]
[62187,"FA","FC Scholarships","FC","FA",62187,"3980FA",308000,300001]
[62188,"RR","FOR Research","FOR","R",62188,"3923RR",382000,300002]
[62189,"RR","FOR Research","FOR","R",62189,"3923RR",382000,300002]
[62190,"RR","FOR Research","FOR","R",62190,"3923RR",382000,300002]
[62191,"RR","FOR Research","FOR","R",62191,"3923RR",382000,300002]
[62192,"RR","FOR Research","FOR","R",62192,"3923RR",382000,300002]
[62193,"RR","FOR Research","FOR","R",62193,"3923RR",382000,300002]
[62194,"RR","FOR Research","FOR","R",62194,"3923RR",382000,300002]
[62195,"GR","FC Institutional Support","FC",{"$error":"#N/A"},62195,"3964GR",306000,300001]
[62196,"GR","FC Institutional Support","FC",{"$error":"#N/A"},62196,"3964GR",306000,300001]
[62197,"GR","FC Institutional Support","FC",{"$error":"#N/A"},62197,"3964GR",306000,300001]
[62198,"PR","FC Public Service","FC",{"$error":"#N/A"},62198,"3932PR",303000,300001]
[62199,"PR","FC Public Service","FC",{"$error":"#N/A"},62199,"3932PR",303000,300001]
[62200,"PR","FC Public Service","FC",{"$error":"#N/A"},62200,"3932PR",303000,300001]
[62201,"AS","FC Academic Support","FC","AS",62201,"3940AS",304000,300001]
[62202,"PR","FC Public Service","FC",{"$error":"#N/A"},62202,"3932PR",303000,300001]
[62203,"PR","FC Public Service","FC",{"$error":"#N/A"},62203,"3932PR",303000,300001]
[62204,"GR","FC Institutional Support","FC",{"$error":"#N/A"},62204,"3964GR",306000,300001]
[62205,"OR","FC Physical Plant","FC",{"$error":"#N/A"},62205,"3973OR",307000,300001]
[62206,"OR","FC Physical Plant","FC",{"$error":"#N/A"},62206,"3976OR",307000,300001]
[62207,"RR","FOR Research","FOR","R",62207,"3921RR",382000,300002]
[62208,"PR","FC Public Service","FC",{"$error":"#N/A"},62208,"3931PR",303000,300001]
[62209,"IR","FC Instruction","FC","I",62209,"3910IR",301000,300001]
[62210,"PR","FC Public Service","FC",{"$error":"#N/A"},62210,"3930PR",303000,300001]
[62211,"RR","FOR Research","FOR","R",62211,"3920RR",382000,300002]
[62212,"RR","FOR Research","FOR","R",62212,"3920RR",382000,300002]
[62213,"RR","FOR Research","FOR","R",62213,"3920RR",382000,300002]
[62214,"RR","FOR Research","FOR","R",62214,"3920RR",382000,300002]
[62215,"RR","FOR Research","FOR","R",62215,"3920RR",382000,300002]
[62216,"RR","FOR Research","FOR","R",62216,"3920RR",382000,300002]
[62217,"PR","FC Public Service","FC",{"$error":"#N/A"},62217,"3932PR",303000,300001]
[62218,"RY","FOR Research","FOR","R",62218,"3920RY",382000,300002]
[62219,"RY","FOR Research","FOR","R",62219,"3960RY",382000,300002]
[62220,"RY","FOR Research","FOR","R",62220,"3920RY",382000,300002]
[62221,"RY","FOR Research","FOR","R",62221,"3920RY",382000,300002]
[62222,"RY","FOR Research","FOR","R",62222,"3920RY",382000,300002]
[62223,"IN","FC Instruction","FC","I",62223,"3910IN",301000,300001]
[62224,"IN","FC Instruction","FC","I",62224,"3910IN",301000,300001]
[62225,"RY","FOR Research","FOR","R",62225,"3920RY",382000,300002]
[62226,"RY","FOR Research","FOR","R",62226,"3920RY",382000,300002]
[62227,"RY","FOR Research","FOR","R",62227,"3920RY",382000,300002]
[{"$f":"IF(F2484>0,VALUE(F2484),\" \")","v":62228},{"$f":"IF(A2484<>\" \",RIGHT(G2484,2),\" \")","v":"RY"},{"$f":"IF(A2484<>\" \",VLOOKUP(H2484,ALLOC_NCHEMS,2,0),\" \")","v":"FOR Research"},{"$f":"IF(A2484<>\" \",VLOOKUP(I2484,ALLOC,2,0),\" \")","v":"FOR"},"R",62228,"3920RY",382000,300002]
[62229,"PS","FC Public Service","FC","PS",62229,"3930PS",303000,300001]
[62230,"PS","FC Public Service","FC","PS",62230,"3930PS",303000,300001]
[62231,"RR","FOR Research","FOR","R",62231,"3920RR",382000,300002]
[62232,"PS","FC Public Service","FC","PS",62232,"3930PS",303000,300001]
[62233,"RR","FOR Research","FOR","R",62233,"3920RR",382000,300002]
[62234,"RR","FOR Research","FOR","R",62234,"3920RR",382000,300002]
[62235,"RR","FOR Research","FOR","R",62235,"3920RR",382000,300002]
[62236,"RT","FOR Research","FOR","R",62236,"3920RT",382000,300002]
[62237,"RT","FOR Research","FOR","R",62237,"3920RT",382000,300002]
[62238,"IN","FC Instruction","FC","I",62238,"3910IN",301000,300001]
[62239,"IN","FC Instruction","FC","I",62239,"3910IN",301000,300001]
[62240,"IN","FC Instruction","FC","I",62240,"3910IN",301000,300001]
[62241,"IN","FC Instruction","FC","I",62241,"3910IN",301000,300001]
[62242,"ID","FC Instruction","FC","I",62242,"3910ID",301000,300001]
[62243,"RZ","FOR Research","FOR",{"$f":"IF(A2499<>\" \",VLOOKUP(B2499,NCHEMS_ABBR,3,0),\" \")","v":"R"},62243,"3920RZ",382000,300002]
[62244,"ID","FC Instruction","FC","I",62244,"3910ID",301000,300001]
[62245,"IN","FC Instruction","FC","I",62245,"3910IN",301000,300001]
[62246,"IN","FC Instruction","FC","I",62246,"3910IN",301000,300001]
[62247,"IN","FC Instruction","FC","I",62247,"3910IN",301000,300001]
[62248,"ID","FC Instruction","FC","I",62248,"3910ID",301000,300001]
[62249,"ID","FC Instruction","FC","I",62249,"3910ID",301000,300001]
[62250,"ID","FC Instruction","FC","I",62250,"3910ID",301000,300001]
[62251,"ID","FC Instruction","FC","I",62251,"3910ID",301000,300001]
[62252,"PM","FC Public Service","FC","PS",62252,"3970PM",303000,300001]
[62253,"RD","FOR Research","FOR","R",62253,"3920RD",382000,300002]
[62254,"PS","FC Public Service","FC","PS",62254,"3930PS",303000,300001]
[62255,"PS","FC Public Service","FC","PS",62255,"3930PS",303000,300001]
[62256,"PS","FC Public Service","FC","PS",62256,"3930PS",303000,300001]
[62257,"PS","FC Public Service","FC","PS",62257,"3930PS",303000,300001]
[62258,"PS","FC Public Service","FC","PS",62258,"3930PS",303000,300001]
[62259,"PS","FC Public Service","FC","PS",62259,"3930PS",303000,300001]
[62260,"PS","FC Public Service","FC","PS",62260,"3930PS",303000,300001]
[62261,"PS","FC Public Service","FC","PS",62261,"3930PS",303000,300001]
[62262,"PS","FC Public Service","FC","PS",62262,"3930PS",303000,300001]
[62263,"PS","FC Public Service","FC","PS",62263,"3930PS",303000,300001]
[62264,"PS","FC Public Service","FC","PS",62264,"3930PS",303000,300001]
[62265,"PD","FC Public Service","FC","PS",62265,"3930PD",303000,300001]
[62266,"PS","FC Public Service","FC","PS",62266,"3930PS",303000,300001]
[62267,"PS","FC Public Service","FC","PS",62267,"3930PS",303000,300001]
[62268,"PS","FC Public Service","FC","PS",62268,"3930PS",303000,300001]
[62269,"PS","FC Public Service","FC","PS",62269,"3930PS",303000,300001]
[62270,"PS","FC Public Service","FC","PS",62270,"3930PS",303000,300001]
[62271,"PS","FC Public Service","FC","PS",62271,"3930PS",303000,300001]
[62272,"PS","FC Public Service","FC","PS",62272,"3930PS",303000,300001]
[62273,"PS","FC Public Service","FC","PS",62273,"3930PS",303000,300001]
[62274,"PS","FC Public Service","FC","PS",62274,"3930PS",303000,300001]
[62275,"AS","FC Academic Support","FC","AS",62275,"3940AS",304000,300001]
[62276,"PS","FC Public Service","FC","PS",62276,"3930PS",303000,300001]
[62277,"PZ","FC Public Service","FC","PS",62277,"3930PZ",303000,300001]
[62278,"PS","FC Public Service","FC","PS",62278,"3930PS",303000,300001]
[62279,"PD","FC Public Service","FC","PS",62279,"3930PD",303000,300001]
[62280,"PD","FC Public Service","FC","PS",62280,"3930PD",303000,300001]
[62281,"PS","FC Public Service","FC","PS",62281,"3930PS",303000,300001]
[62282,"PS","FC Public Service","FC","PS",62282,"3930PS",303000,300001]
[62283,"PS","FC Public Service","FC","PS",62283,"3930PS",303000,300001]
[62284,"SS","FC Student Services","FC","SS",62284,"3940SS",305000,300001]
[62285,"AS","FC Academic Support","FC","AS",62285,"3940AS",304000,300001]
[62286,"AS","FC Academic Support","FC","AS",62286,"3940AS",304000,300001]
[62287,"AS","FC Academic Support","FC","AS",62287,"3940AS",304000,300001]
[62288,"RR","FOR Research","FOR","R",62288,"3920RR",382000,300002]
[62289,"AS","FC Academic Support","FC","AS",62289,"3940AS",304000,300001]
[62290,"AS","FC Academic Support","FC","AS",62290,"3940AS",304000,300001]
[62291,"AS","FC Academic Support","FC","AS",62291,"3940AS",304000,300001]
[{"$f":"IF(F2548>0,VALUE(F2548),\" \")","v":62292},{"$f":"IF(A2548<>\" \",RIGHT(G2548,2),\" \")","v":"AS"},{"$f":"IF(A2548<>\" \",VLOOKUP(H2548,ALLOC_NCHEMS,2,0),\" \")","v":"FC Academic Support"},{"$f":"IF(A2548<>\" \",VLOOKUP(I2548,ALLOC,2,0),\" \")","v":"FC"},"AS",62292,"3960AS",304000,300001]
[62293,"RD","FOR Research","FOR","R",62293,"3920RD",382000,300002]
[62294,"RR","FOR Research","FOR","R",62294,"3920RR",382000,300002]
[62295,"RD","FOR Research","FOR","R",62295,"3920RD",382000,300002]
[62296,"PS","FC Public Service","FC","PS",62296,"3930PS",303000,300001]
[62297,"RD","FOR Research","FOR","R",62297,"3920RD",382000,300002]
[62298,"OM","FC Physical Plant","FC","PP",62298,"3970OM",307000,300001]
[62299,"RR","FOR Research","FOR","R",62299,"3924RR",382000,300002]
[{"$error":"#VALUE!"},{"$error":"#VALUE!"},{"$error":"#VALUE!"},{"$error":"#VALUE!"},{"$error":"#VALUE!"},"62299F","3924RR",382000,300002]
[62300,"RD","FOR Research","FOR","R",62300,"3960RD",382000,300002]
[62301,"RD","FOR Research","FOR","R",62301,"3960RD",382000,300002]
[62302,"PD","FC Public Service","FC","PS",62302,"3930PD",303000,300001]
[62303,"RD","FOR Research","FOR","R",62303,"3960RD",382000,300002]
[62304,"RD","FOR Research","FOR","R",62304,"3960RD",382000,300002]
[62305,"RD","FOR Research","FOR","R",62305,"3920RD",382000,300002]
[62306,"AS","FC Academic Support","FC",{"$f":"IF(A2563<>\" \",VLOOKUP(B2563,NCHEMS_ABBR,3,0),\" \")","v":"AS"},62306,"3960AS",304000,300001]
[62307,"RD","FOR Research","FOR","R",62307,"3960RD",382000,300002]
[62308,"OM","FC Physical Plant","FC","PP",62308,"3970OM",307000,300001]
[62309,"RM","FOR Research","FOR","R",62309,"3825RM",382000,300002]
[62310,"RD","FOR Research","FOR","R",62310,"3960RD",382000,300002]
[62311,"RR","FOR Research","FOR","R",62311,"3924RR",382000,300002]
[62312,"PD","FC Public Service","FC","PS",62312,"3930PD",303000,300001]
[62313,"PS","FC Public Service","FC","PS",62313,"3960PS",303000,300001]
[62314,"AS","FC Academic Support","FC","AS",62314,"3960AS",304000,300001]
[62315,"AS","FC Academic Support","FC","AS",62315,"3960AS",304000,300001]
[62316,"PD","FC Public Service","FC","PS",62316,"3930PD",303000,300001]
[62317,"AS","FC Academic Support","FC","AS",62317,"3960AS",304000,300001]
[62318,"AS","FC Academic Support","FC","AS",62318,"3960AS",304000,300001]
[62319,"AS","FC Academic Support","FC","AS",62319,"3960AS",304000,300001]
[62320,"AS","FC Academic Support","FC","AS",62320,"3960AS",304000,300001]
[62321,"ID","FC Instruction","FC","I",62321,"3910ID",301000,300001]
[62322,"RM","FOR Research","FOR","R",62322,"3825RM",382000,300002]
[62323,"AS","FC Academic Support","FC","AS",62323,"3960AS",304000,300001]
[62324,"RD","FOR Research","FOR","R",62324,"3960RD",382000,300002]
[62325,"RD","FOR Research","FOR","R",62325,"3960RD",382000,300002]
[62326,"RM","FOR Research","FOR","R",62326,"3962RM",382000,300002]
[62327,"OM","FC Physical Plant","FC","PP",62327,"3970OM",307000,300001]
[62328,"AS","FC Academic Support","FC","AS",62328,"3960AS",304000,300001]
[62329,"RD","FOR Research","FOR","R",62329,"3960RD",382000,300002]
[62330,"OM","FC Physical Plant","FC","PP",62330,"3970OM",307000,300001]
[62331,"OM","FC Physical Plant","FC","PP",62331,"3970OM",307000,300001]
[62332,"OM","FC Physical Plant","FC","PP",62332,"3970OM",307000,300001]
[62333,"OM","FC Physical Plant","FC","PP",62333,"3970OM",307000,300001]
[62334,"RR","FOR Research","FOR","R",62334,"3920RR",382000,300002]
[62335,"OM","FC Physical Plant","FC","PP",62335,"3970OM",307000,300001]
[62336,"OM","FC Physical Plant","FC","PP",62336,"3970OM",307000,300001]
[62337,"OM","FC Physical Plant","FC","PP",62337,"3970OM",307000,300001]
[62338,"OM","FC Physical Plant","FC","PP",62338,"3970OM",307000,300001]
[62339,"PS","FC Public Service","FC","PS",62339,"3930PS",303000,300001]
[62340,"OM","FC Physical Plant","FC","PP",62340,"3970OM",307000,300001]
[62341,"OM","FC Physical Plant","FC","PP",62341,"3970OM",307000,300001]
[62342,"PS","FC Public Service","FC","PS",62342,"3930PS",303000,300001]
[62343,"OM","FC Physical Plant","FC","PP",62343,"3970OM",307000,300001]
[62344,"OM","FC Physical Plant","FC","PP",62344,"3970OM",307000,300001]
[62345,"OM","FC Physical Plant","FC","PP",62345,"3970OM",307000,300001]
[62346,"RR","FOR Research","FOR","R",62346,"3920RR",382000,300002]
[62347,"OM","FC Physical Plant","FC","PP",62347,"3970OM",307000,300001]
[62348,"PM","FC Public Service","FC","PS",62348,"3970PM",303000,300001]
[62349,"PM","FC Public Service","FC","PS",62349,"3970PM",303000,300001]
[62350,"RR","FOR Research","FOR","R",62350,"3922RR",382000,300002]
[62351,"PM","FC Public Service","FC","PS",62351,"3970PM",303000,300001]
[62352,"RR","FOR Research","FOR","R",62352,"3920RR",382000,300002]
[62353,"PM","FC Public Service","FC","PS",62353,"3970PM",303000,300001]
[62354,"OM","FC Physical Plant","FC","PP",62354,"3970OM",307000,300001]
[{"$f":"IF(F2612>0,VALUE(F2612),\" \")","v":62355},{"$f":"IF(A2612<>\" \",RIGHT(G2612,2),\" \")","v":"OM"},{"$f":"IF(A2612<>\" \",VLOOKUP(H2612,ALLOC_NCHEMS,2,0),\" \")","v":"FC Physical Plant"},{"$f":"IF(A2612<>\" \",VLOOKUP(I2612,ALLOC,2,0),\" \")","v":"FC"},"PP",62355,"3970OM",307000,300001]
[62356,"PS","FC Public Service","FC","PS",62356,"3930PS",303000,300001]
[62357,"RR","FOR Research","FOR","R",62357,"3924RR",382000,300002]
[62358,"IN","FC Instruction","FC","I",62358,"3910IN",301000,300001]
[62359,"PZ","FC Public Service","FC","PS",62359,"3930PZ",303000,300001]
[62360,"RR","FOR Research","FOR","R",62360,"3922RR",382000,300002]
[62361,"FA","FC Scholarships","FC","FA",62361,"3910FA",308000,300001]
[62362,"RR","FOR Research","FOR","R",62362,"3920RR",382000,300002]
[62363,"RY","FOR Research","FOR","R",62363,"3920RY",382000,300002]
[62364,"RY","FOR Research","FOR","R",62364,"3920RY",382000,300002]
[62365,"RD","FOR Research","FOR","R",62365,"3920RD",382000,300002]
[62366,"RR","FOR Research","FOR","R",62366,"3920RR",382000,300002]
[62367,"RR","FOR Research","FOR","R",62367,"3920RR",382000,300002]
[62368,"PS","FC Public Service","FC","PS",62368,"3930PS",303000,300001]
[62369,"PM","FC Public Service","FC","PS",62369,"3970PM",303000,300001]
[62370,"RR","FOR Research","FOR",{"$f":"IF(A2627<>\" \",VLOOKUP(B2627,NCHEMS_ABBR,3,0),\" \")","v":"R"},62370,"3920RR",382000,300002]
[62371,"RR","FOR Research","FOR","R",62371,"3920RR",382000,300002]
[62372,"RD","FOR Research","FOR","R",62372,"3920RD",382000,300002]
[62373,"RR","FOR Research","FOR","R",62373,"3920RR",382000,300002]
[62374,"RD","FOR Research","FOR","R",62374,"3920RD",382000,300002]
[62375,"PS","FC Public Service","FC","PS",62375,"3930PS",303000,300001]
[62376,"RD","FOR Research","FOR","R",62376,"3920RD",382000,300002]
[62377,"RD","FOR Research","FOR","R",62377,"3920RD",382000,300002]
[62378,"RD","FOR Research","FOR","R",62378,"3920RD",382000,300002]
[62379,"RD","FOR Research","FOR","R",62379,"3920RD",382000,300002]
[62380,"RD","FOR Research","FOR","R",62380,"3920RD",382000,300002]
[62381,"PS","FC Public Service","FC","PS",62381,"3930PS",303000,300001]
[62382,"RR","FOR Research","FOR","R",62382,"3922RR",382000,300002]
[62383,"RD","FOR Research","FOR","R",62383,"3920RD",382000,300002]
[62384,"PM","FC Public Service","FC","PS",62384,"3970PM",303000,300001]
[62385,"RD","FOR Research","FOR","R",62385,"3920RD",382000,300002]
[62386,"IN","FC Instruction","FC","I",62386,"3910IN",301000,300001]
[62387,"PM","FC Public Service","FC","PS",62387,"3970PM",303000,300001]
[62388,"RR","FOR Research","FOR","R",62388,"3920RR",382000,300002]
[62389,"IN","FC Instruction","FC","I",62389,"3910IN",301000,300001]
[62390,"RD","FOR Research","FOR","R",62390,"3920RD",382000,300002]
[62391,"RY","FOR Research","FOR","R",62391,"3960RY",382000,300002]
[62392,"RR","FOR Research","FOR","R",62392,"3924RR",382000,300002]
[62393,"RR","FOR Research","FOR","R",62393,"3924RR",382000,300002]
[62394,"RR","FOR Research","FOR","R",62394,"3924RR",382000,300002]
[62395,"RR","FOR Research","FOR","R",62395,"3924RR",382000,300002]
[62396,"AS","FC Academic Support","FC","AS",62396,"3960AS",304000,300001]
[62397,"AS","FC Academic Support","FC","AS",62397,"3960AS",304000,300001]
[62398,"RD","FOR Research","FOR","R",62398,"3920RD",382000,300002]
[62399,"RD","FOR Research","FOR","R",62399,"3960RD",382000,300002]
[62400,"AS","FC Academic Support","FC","AS",62400,"3960AS",304000,300001]
[62401,"RY","FOR Research","FOR","R",62401,"3920RY",382000,300002]
[62402,"AS","FC Academic Support","FC","AS",62402,"3960AS",304000,300001]
[62403,"RR","FOR Research","FOR","R",62403,"3920RR",382000,300002]
[62404,"RR","FOR Research","FOR","R",62404,"3920RR",382000,300002]
[62405,"RD","FOR Research","FOR","R",62405,"3920RD",382000,300002]
[62406,"RR","FOR Research","FOR","R",62406,"3920RR",382000,300002]
[62407,"RD","FOR Research","FOR","R",62407,"3920RD",382000,300002]
[62408,"IN","FC Instruction","FC","I",62408,"3970IN",301000,300001]
[62411,"RR","FOR Research","FOR","R",62411,"3922RR",382000,300002]
[62412,"RR","FOR Research","FOR","R",62412,"3920RR",382000,300002]
[62413,"RR","FOR Research","FOR","R",62413,"3920RR",382000,300002]
[62415,"PS","FC Public Service","FC","PS",62415,"3930PS",303000,300001]
[62416,"PS","FC Public Service","FC","PS",62416,"3930PS",303000,300001]
[62430,"RR","FOR Research","FOR","R",62430,"3922RR",382000,300002]
[62431,"AS","FC Academic Support","FC","AS",62431,"3960AS",304000,300001]
[62432,"AS","FC Academic Support","FC","AS",62432,"3960AS",304000,300001]
[62433,"RR","FOR Research","FOR","R",62433,"3922RR",382000,300002]
[62434,"RR","FOR Research","FOR","R",62434,"3922RR",382000,300002]
[{"$f":"IF(F2676>0,VALUE(F2676),\" \")","v":62435},{"$f":"IF(A2676<>\" \",RIGHT(G2676,2),\" \")","v":"PD"},{"$f":"IF(A2676<>\" \",VLOOKUP(H2676,ALLOC_NCHEMS,2,0),\" \")","v":"FC Public Service"},{"$f":"IF(A2676<>\" \",VLOOKUP(I2676,ALLOC,2,0),\" \")","v":"FC"},"PS",62435,"3930PD",303000,300001]
[62436,"RR","FOR Research","FOR","R",62436,"3922RR",382000,300002]
[62437,"RR","FOR Research","FOR","R",62437,"3922RR",382000,300002]
[62438,"RR","FOR Research","FOR","R",62438,"3922RR",382000,300002]
[62439,"RY","FOR Research","FOR","R",62439,"3920RY",382000,300002]
[62440,"AS","FC Academic Support","FC","AS",62440,"3960AS",304000,300001]
[62450,"RD","FOR Research","FOR","R",62450,"3920RD",382000,300002]
[62499,"RD","FOR Research","FOR","R",62499,"3960RD",382000,300002]
[62500,"RT","FOR Research","FOR","R",62500,"3920RT",382000,300002]
[62501,"RT","FOR Research","FOR","R",62501,"3922RT",382000,300002]
[62502,"RT","FOR Research","FOR","R",62502,"3921RT",382000,300002]
[62503,"RT","FOR Research","FOR","R",62503,"3924RT",382000,300002]
[62504,"IN","FC Instruction","FC","I",62504,"3910IN",301000,300001]
[62505,"RT","FOR Research","FOR","R",62505,"3923RT",382000,300002]
[62506,"RT","FOR Research","FOR","R",62506,"3920RT",382000,300002]
[62507,"OM","FC Physical Plant","FC",{"$f":"IF(A2691<>\" \",VLOOKUP(B2691,NCHEMS_ABBR,3,0),\" \")","v":"PP"},62507,"3970OM",307000,300001]
[62508,"AS","FC Academic Support","FC","AS",62508,"3960AS",304000,300001]
[62509,"PS","FOR Public Service","FOR","PS",62509,"3830PS",383000,300002]
[62510,"FA","FC Scholarships","FC","FA",62510,"3910FA",308000,300001]
[62511,"RR","FOR Research","FOR","R",62511,"3924RR",382000,300002]
[62512,"OM","FC Physical Plant","FC","PP",62512,"3970OM",307000,300001]
[62513,"OM","FC Physical Plant","FC","PP",62513,"3970OM",307000,300001]
[62514,"RR","FOR Research","FOR","R",62514,"3920RR",382000,300002]
[62515,"RY","FOR Research","FOR","R",62515,"3920RY",382000,300002]
[62516,"RR","FOR Research","FOR","R",62516,"3922RR",382000,300002]
[62517,"RD","FOR Research","FOR","R",62517,"3920RD",382000,300002]
[62518,"PS","FC Public Service","FC","PS",62518,"3930PS",303000,300001]
[62520,"RY","FOR Research","FOR","R",62520,"3920RY",382000,300002]
[62521,"AS","FC Academic Support","FC","AS",62521,"3940AS",304000,300001]
[62525,"PS","FC Public Service","FC","PS",62525,"3930PS",303000,300001]
[62550,"RY","FOR Research","FOR","R",62550,"3920RY",382000,300002]
[62570,"RY","FOR Research","FOR","R",62570,"3920RY",382000,300002]
[62580,"RY","FOR Research","FOR","R",62580,"3828RY",382000,300002]
[62596,"RD","FOR Research","FOR","R",62596,"3960RD",382000,300002]
[62599,"RY","FOR Research","FOR","R",62599,"3920RY",382000,300002]
[63000,"RD","FOR Research","FOR","R",63000,"3822RD",382000,300002]
[63001,"RD","FOR Research","FOR","R",63001,"3822RD",382000,300002]
[63002,"RR","FOR Research","FOR","R",63002,"3822RR",382000,300002]
[63003,"FA","FOR Financial Aid/Schol","FOR","FA",63003,"3882FA",388000,300002]
[63004,"RR","FOR Research","FOR","R",63004,"3822RR",382000,300002]
[63005,"RR","FOR Research","FOR","R",63005,"3822RR",382000,300002]
[63006,"RR","FOR Research","FOR","R",63006,"3822RR",382000,300002]
[63007,"RD","FOR Research","FOR","R",63007,"3822RD",382000,300002]
[63008,"RR","FOR Research","FOR","R",63008,"3822RR",382000,300002]
[63009,"RD","FOR Research","FOR","R",63009,"3822RD",382000,300002]
[63010,"RD","FOR Research","FOR","R",63010,"3822RD",382000,300002]
[63011,"RR","FOR Research","FOR","R",63011,"3822RR",382000,300002]
[63012,"PS","FOR Public Service","FOR","PS",63012,"3822PS",383000,300002]
[63013,"RD","FOR Research","FOR","R",63013,"3822RD",382000,300002]
[63014,"RR","FOR Research","FOR","R",63014,"3822RR",382000,300002]
[63015,"RR","FOR Research","FOR","R",63015,"3822RR",382000,300002]
[63016,"RD","FOR Research","FOR","R",63016,"3822RD",382000,300002]
[63017,"RR","FOR Research","FOR","R",63017,"3822RR",382000,300002]
[63018,"RR","FOR Research","FOR","R",63018,"3822RR",382000,300002]
[63019,"RT","FOR Research","FOR","R",63019,"3822RT",382000,300002]
[63020,"RR","FOR Research","FOR","R",63020,"3822RR",382000,300002]
[63021,"RR","FOR Research","FOR","R",63021,"3822RR",382000,300002]
[63022,"RR","FOR Research","FOR","R",63022,"3822RR",382000,300002]
[63023,"RR","FOR Research","FOR","R",63023,"3822RR",382000,300002]
[63024,"RD","FOR Research","FOR","R",63024,"3822RD",382000,300002]
[63025,"RR","FOR Research","FOR","R",63025,"3822RR",382000,300002]
[63026,"RR","FOR Research","FOR","R",63026,"3822RR",382000,300002]
[63027,"RR","FOR Research","FOR","R",63027,"3822RR",382000,300002]
[63028,"RR","FOR Research","FOR","R",63028,"3822RR",382000,300002]
[{"$f":"IF(F2740>0,VALUE(F2740),\" \")","v":63029},{"$f":"IF(A2740<>\" \",RIGHT(G2740,2),\" \")","v":"RR"},{"$f":"IF(A2740<>\" \",VLOOKUP(H2740,ALLOC_NCHEMS,2,0),\" \")","v":"FOR Research"},{"$f":"IF(A2740<>\" \",VLOOKUP(I2740,ALLOC,2,0),\" \")","v":"FOR"},"R",63029,"3822RR",382000,300002]
[63030,"RD","FOR Research","FOR","R",63030,"3822RD",382000,300002]
[63031,"RR","FOR Research","FOR","R",63031,"3822RR",382000,300002]
[63032,"PZ","FOR Public Service","FOR","PS",63032,"3822PZ",383000,300002]
[63033,"RM","FOR Research","FOR","R",63033,"3822RM",382000,300002]
[63034,"RM","FOR Research","FOR","R",63034,"3822RM",382000,300002]
[63035,"RR","FOR Research","FOR","R",63035,"3822RR",382000,300002]
[63036,"RR","FOR Research","FOR","R",63036,"3822RR",382000,300002]
[63037,"RR","FOR Research","FOR","R",63037,"3822RR",382000,300002]
[63038,"RR","FOR Research","FOR","R",63038,"3822RR",382000,300002]
[63039,"PS","FOR Public Service","FOR","PS",63039,"3822PS",383000,300002]
[63040,"RR","FOR Research","FOR","R",63040,"3822RR",382000,300002]
[63041,"RD","FOR Research","FOR","R",63041,"3822RD",382000,300002]
[63042,"RR","FOR Research","FOR","R",63042,"3822RR",382000,300002]
[63043,"RR","FOR Research","FOR","R",63043,"3822RR",382000,300002]
[63044,"RR","FOR Research","FOR",{"$f":"IF(A2755<>\" \",VLOOKUP(B2755,NCHEMS_ABBR,3,0),\" \")","v":"R"},63044,"3822RR",382000,300002]
[63045,"RR","FOR Research","FOR","R",63045,"3822RR",382000,300002]
[63046,"RR","FOR Research","FOR","R",63046,"3822RR",382000,300002]
[63047,"RR","FOR Research","FOR","R",63047,"3822RR",382000,300002]
[63048,"RR","FOR Research","FOR","R",63048,"3822RR",382000,300002]
[63049,"RR","FOR Research","FOR","R",63049,"3822RR",382000,300002]
[63050,"RR","FOR Research","FOR","R",63050,"3822RR",382000,300002]
[63051,"FA","FOR Financial Aid/Schol","FOR","FA",63051,"3882FA",388000,300002]
[63052,"RR","FOR Research","FOR","R",63052,"3822RR",382000,300002]
[63053,"RR","FOR Research","FOR","R",63053,"3822RR",382000,300002]
[63054,"RM","FOR Research","FOR","R",63054,"3822RM",382000,300002]
[63055,"RR","FOR Research","FOR","R",63055,"3822RR",382000,300002]
[63056,"RR","FOR Research","FOR","R",63056,"3822RR",382000,300002]
[63057,"RR","FOR Research","FOR","R",63057,"3822RR",382000,300002]
[63058,"RT","FOR Research","FOR","R",63058,"3822RT",382000,300002]
[63059,"RR","FOR Research","FOR","R",63059,"3822RR",382000,300002]
[63060,"RR","FOR Research","FOR","R",63060,"3822RR",382000,300002]
[63061,"RR","FOR Research","FOR","R",63061,"3822RR",382000,300002]
[63062,"RR","FOR Research","FOR","R",63062,"3822RR",382000,300002]
[63063,"RM","FOR Research","FOR","R",63063,"3822RM",382000,300002]
[63064,"RM","FOR Research","FOR","R",63064,"3822RM",382000,300002]
[63065,"RR","FOR Research","FOR","R",63065,"3822RR",382000,300002]
[63066,"PS","FOR Public Service","FOR","PS",63066,"3822PS",383000,300002]
[63067,"RD","FOR Research","FOR","R",63067,"3822RD",382000,300002]
[63068,"RR","FOR Research","FOR","R",63068,"3822RR",382000,300002]
[63069,"RR","FOR Research","FOR","R",63069,"3822RR",382000,300002]
[63070,"RR","FOR Research","FOR","R",63070,"382GRR",382000,300002]
[63071,"RR","FOR Research","FOR","R",63071,"3822RR",382000,300002]
[63072,"RR","FOR Research","FOR","R",63072,"3822RR",382000,300002]
[63073,"RR","FOR Research","FOR","R",63073,"3822RR",382000,300002]
[63074,"RR","FOR Research","FOR","R",63074,"3822RR",382000,300002]
[63075,"RR","FOR Research","FOR","R",63075,"3822RR",382000,300002]
[63076,"RR","FOR Research","FOR","R",63076,"3822RR",382000,300002]
[63077,"RR","FOR Research","FOR","R",63077,"3822RR",382000,300002]
[63078,"FA","FOR Financial Aid/Schol","FOR","FA",63078,"3882FA",388000,300002]
[63079,"RR","FOR Research","FOR","R",63079,"382GRR",382000,300002]
[63080,"PS","FC Public Service","FC","PS",63080,"303EPS",303000,300001]
[63081,"RR","FOR Research","FOR","R",63081,"3822RR",382000,300002]
[63082,"RR","FOR Research","FOR","R",63082,"3822RR",382000,300002]
[63083,"RR","FOR Research","FOR","R",63083,"3822RR",382000,300002]
[63084,"RT","FOR Research","FOR","R",63084,"3822RT",382000,300002]
[63085,"RR","FOR Research","FOR","R",63085,"382GRR",382000,300002]
[63086,"RR","FOR Research","FOR","R",63086,"382GRR",382000,300002]
[63087,"IN","FC Instruction","FC","I",63087,"3012IN",301000,300001]
[63088,"IN","FC Instruction","FC","I",63088,"3012IN",301000,300001]
[63089,"AS","FC Academic Support","FC","AS",63089,"304BAS",304000,300001]
[63090,"IN","FC Instruction","FC","I",63090,"3012IN",301000,300001]
[63091,"IN","FC Instruction","FC","I",63091,"3012IN",301000,300001]
[63092,"IN","FC Instruction","FC","I",63092,"3012IN",301000,300001]
[{"$f":"IF(F2804>0,VALUE(F2804),\" \")","v":63093},{"$f":"IF(A2804<>\" \",RIGHT(G2804,2),\" \")","v":"IN"},{"$f":"IF(A2804<>\" \",VLOOKUP(H2804,ALLOC_NCHEMS,2,0),\" \")","v":"FC Instruction"},{"$f":"IF(A2804<>\" \",VLOOKUP(I2804,ALLOC,2,0),\" \")","v":"FC"},"I",63093,"3012IN",301000,300001]
[63094,"IN","FC Instruction","FC","I",63094,"3012IN",301000,300001]
[63095,"PS","FC Public Service","FC","PS",63095,"303EPS",303000,300001]
[63096,"IN","FC Instruction","FC","I",63096,"3012IN",301000,300001]
[63097,"RR","FOR Research","FOR","R",63097,"3822RR",382000,300002]
[63098,"ID","FC Instruction","FC","I",63098,"3012ID",301000,300001]
[63099,"ID","FC Instruction","FC","I",63099,"3012ID",301000,300001]
[63100,"AS","FC Academic Support","FC","AS",63100,"304BAS",304000,300001]
[63101,"IN","FC Instruction","FC","I",63101,"3012IN",301000,300001]
[63102,"RR","FOR Research","FOR","R",63102,"3822RR",382000,300002]
[63103,"IN","FC Instruction","FC","I",63103,"3012IN",301000,300001]
[63104,"RR","FOR Research","FOR","R",63104,"3822RR",382000,300002]
[63105,"RR","FOR Research","FOR","R",63105,"3822RR",382000,300002]
[63106,"RR","FOR Research","FOR","R",63106,"3822RR",382000,300002]
[63107,"RR","FOR Research","FOR","R",63107,"3822RR",382000,300002]
[63108,"RR","FOR Research","FOR",{"$f":"IF(A2819<>\" \",VLOOKUP(B2819,NCHEMS_ABBR,3,0),\" \")","v":"R"},63108,"3822RR",382000,300002]
[63109,"RM","FOR Research","FOR","R",63109,"3822RM",382000,300002]
[63110,"RM","FOR Research","FOR","R",63110,"3822RM",382000,300002]
[63111,"RD","FOR Research","FOR","R",63111,"3822RD",382000,300002]
[63112,"RR","FOR Research","FOR","R",63112,"3822RR",382000,300002]
[63113,"RR","FOR Research","FOR","R",63113,"3822RR",382000,300002]
[63114,"IN","FC Instruction","FC","I",63114,"3012IN",301000,300001]
[63115,"RR","FOR Research","FOR","R",63115,"3822RR",382000,300002]
[63116,"RR","FOR Research","FOR","R",63116,"3822RR",382000,300002]
[63117,"PS","FOR Public Service","FOR","PS",63117,"3822PS",383000,300002]
[63118,"RR","FOR Research","FOR","R",63118,"3822RR",382000,300002]
[63119,"RR","FOR Research","FOR","R",63119,"3822RR",382000,300002]
[63120,"RR","FOR Research","FOR","R",63120,"3822RR",382000,300002]
[63121,"RR","FOR Research","FOR","R",63121,"3822RR",382000,300002]
[63122,"RM","FOR Research","FOR","R",63122,"3822RM",382000,300002]
[63123,"RR","FOR Research","FOR","R",63123,"3822RR",382000,300002]
[63124,"RD","FOR Research","FOR","R",63124,"3822RD",382000,300002]
[63125,"RM","FOR Research","FOR","R",63125,"3822RM",382000,300002]
[63126,"RM","FOR Research","FOR","R",63126,"3822RM",382000,300002]
[63127,"RM","FOR Research","FOR","R",63127,"3822RM",382000,300002]
[63128,"RM","FOR Research","FOR","R",63128,"3822RM",382000,300002]
[63129,"RD","FOR Research","FOR","R",63129,"3822RD",382000,300002]
[63130,"PS","FOR Public Service","FOR","PS",63130,"3822PS",383000,300002]
[63131,"RM","FOR Research","FOR","R",63131,"3822RM",382000,300002]
[63132,"RM","FOR Research","FOR","R",63132,"3822RM",382000,300002]
[63133,"RM","FOR Research","FOR","R",63133,"3822RM",382000,300002]
[63134,"RR","FOR Research","FOR","R",63134,"3822RR",382000,300002]
[63135,"RR","FOR Research","FOR","R",63135,"3822RR",382000,300002]
[63136,"RR","FOR Research","FOR","R",63136,"3822RR",382000,300002]
[63137,"RR","FOR Research","FOR","R",63137,"3822RR",382000,300002]
[63138,"RR","FOR Research","FOR","R",63138,"3822RR",382000,300002]
[63139,"RR","FOR Research","FOR","R",63139,"3822RR",382000,300002]
[63140,"RR","FOR Research","FOR","R",63140,"3822RR",382000,300002]
[63141,"AS","FC Academic Support","FC","AS",63141,"304BAS",304000,300001]
[63142,"PS","FC Public Service","FC","PS",63142,"303EPS",303000,300001]
[63143,"PS","FC Public Service","FC","PS",63143,"303EPS",303000,300001]
[63144,"RR","FOR Research","FOR","R",63144,"3822RR",382000,300002]
[63145,"RR","FOR Research","FOR","R",63145,"3822RR",382000,300002]
[63146,"IN","FC Instruction","FC","I",63146,"3012IN",301000,300001]
[63148,"RR","FOR Research","FOR","R",63148,"3822RR",382000,300002]
[63149,"RR","FOR Research","FOR","R",63149,"3822RR",382000,300002]
[63150,"RR","FOR Research","FOR","R",63150,"3822RR",382000,300002]
[63151,"RM","FOR Research","FOR","R",63151,"3822RM",382000,300002]
[63152,"RD","FOR Research","FOR","R",63152,"3822RD",382000,300002]
[63153,"RM","FOR Research","FOR","R",63153,"3822RM",382000,300002]
[63154,"RR","FOR Research","FOR","R",63154,"3822RR",382000,300002]
[63155,"PS","FOR Public Service","FOR","PS",63155,"3822PS",383000,300002]
[63156,"PS","FOR Public Service","FOR","PS",63156,"3822PS",383000,300002]
[63157,"RM","FOR Research","FOR","R",63157,"3822RM",382000,300002]
[{"$f":"IF(F2868>0,VALUE(F2868),\" \")","v":63158},{"$f":"IF(A2868<>\" \",RIGHT(G2868,2),\" \")","v":"ID"},{"$f":"IF(A2868<>\" \",VLOOKUP(H2868,ALLOC_NCHEMS,2,0),\" \")","v":"FC Instruction"},{"$f":"IF(A2868<>\" \",VLOOKUP(I2868,ALLOC,2,0),\" \")","v":"FC"},"I",63158,"3012ID",301000,300001]
[63159,"ID","FC Instruction","FC","I",63159,"3012ID",301000,300001]
[63160,"RT","FOR Research","FOR","R",63160,"3822RT",382000,300002]
[63161,"IN","FC Instruction","FC","I",63161,"3012IN",301000,300001]
[63162,"RR","FOR Research","FOR","R",63162,"3822RR",382000,300002]
[63163,"FA","FC Scholarships","FC","FA",63163,"3086FA",308000,300001]
[63164,"FA","FC Scholarships","FC","FA",63164,"3086FA",308000,300001]
[63165,"RR","FOR Research","FOR","R",63165,"3822RR",382000,300002]
[63166,"IN","FC Instruction","FC","I",63166,"3012IN",301000,300001]
[63167,"RR","FOR Research","FOR","R",63167,"3822RR",382000,300002]
[63168,"RR","FOR Research","FOR","R",63168,"3822RR",382000,300002]
[63169,"RR","FOR Research","FOR","R",63169,"3822RR",382000,300002]
[63170,"PS","FOR Public Service","FOR","PS",63170,"3822PS",383000,300002]
[63171,"PS","FOR Public Service","FOR","PS",63171,"3822PS",383000,300002]
[63172,"RR","FOR Research","FOR","R",63172,"3822RR",382000,300002]
[63173,"RR","FOR Research","FOR",{"$f":"IF(A2883<>\" \",VLOOKUP(B2883,NCHEMS_ABBR,3,0),\" \")","v":"R"},63173,"3822RR",382000,300002]
[63174,"RR","FOR Research","FOR","R",63174,"3822RR",382000,300002]
[63175,"RR","FOR Research","FOR","R",63175,"3822RR",382000,300002]
[63176,"RR","FOR Research","FOR","R",63176,"3822RR",382000,300002]
[63177,"RR","FOR Research","FOR","R",63177,"3822RR",382000,300002]
[63178,"RR","FOR Research","FOR","R",63178,"3822RR",382000,300002]
[63179,"RR","FOR Research","FOR","R",63179,"3822RR",382000,300002]
[63180,"RR","FOR Research","FOR","R",63180,"3822RR",382000,300002]
[63181,"RD","FOR Research","FOR","R",63181,"3822RD",382000,300002]
[63182,"RD","FOR Research","FOR","R",63182,"3822RD",382000,300002]
[63183,"RR","FOR Research","FOR","R",63183,"3822RR",382000,300002]
[63184,"RR","FOR Research","FOR","R",63184,"3822RR",382000,300002]
[63185,"RR","FOR Research","FOR","R",63185,"3822RR",382000,300002]
[63186,"PS","FC Public Service","FC","PS",63186,"303EPS",303000,300001]
[63187,"PS","FC Public Service","FC","PS",63187,"303EPS",303000,300001]
[63188,"RR","FOR Research","FOR","R",63188,"3822RR",382000,300002]
[63200,"IN","FC Instruction","FC","I",63200,"3012IN",301000,300001]
[63201,"PS","FC Public Service","FC","PS",63201,"303EPS",303000,300001]
[63250,"RR","FOR Research","FOR","R",63250,"3822RR",382000,300002]
[63251,"RR","FOR Research","FOR","R",63251,"3822RR",382000,300002]
[63300,"RR","FOR Research","FOR","R",63300,"3822RR",382000,300002]
[63301,"RR","FOR Research","FOR","R",63301,"3822RR",382000,300002]
[63302,"RR","FOR Research","FOR","R",63302,"3822RR",382000,300002]
[63303,"RR","FOR Research","FOR","R",63303,"3822RR",382000,300002]
[63304,"RR","FOR Research","FOR","R",63304,"3822RR",382000,300002]
[63305,"RR","FOR Research","FOR","R",63305,"3822RR",382000,300002]
[63306,"RR","FOR Research","FOR","R",63306,"3822RR",382000,300002]
[63307,"RR","FOR Research","FOR","R",63307,"3822RR",382000,300002]
[63340,"RD","FOR Research","FOR","R",63340,"3822RD",382000,300002]
[63345,"RD","FOR Research","FOR","R",63345,"3822RD",382000,300002]
[63351,"RR","FOR Research","FOR","R",63351,"3822RR",382000,300002]
[63352,"RR","FOR Research","FOR","R",63352,"3822RR",382000,300002]
[63353,"RR","FOR Research","FOR","R",63353,"3822RR",382000,300002]
[63354,"RR","FOR Research","FOR","R",63354,"3822RR",382000,300002]
[63360,"RD","FOR Research","FOR","R",63360,"3822RD",382000,300002]
[63999,"RR","FOR Research","FOR","R",63999,"3822RR",382000,300002]
[64000,"PD","CES Public Services","CES","PS",64000,"3330PD",333000,200001]
[64001,"PS","CES Public Services","CES","PS",64001,"3330PS",333000,200001]
[64002,"PD","CES Public Services","CES","PS",64002,"3330PD",333000,200001]
[64003,"PS","CES Public Services","CES","PS",64003,"3330PS",333000,200001]
[64004,"PS","CES Public Services","CES","PS",64004,"3330PS",333000,200001]
[64005,"PD","CES Public Services","CES","PS",64005,"3330PD",333000,200001]
[64006,"PS","CES Public Services","CES","PS",64006,"3330PS",333000,200001]
[64007,"PD","CES Public Services","CES","PS",64007,"3330PD",333000,200001]
[64008,"PS","CES Public Services","CES","PS",64008,"3330PS",333000,200001]
[64009,"PM","CES Public Services","CES","PS",64009,"3330PM",333000,200001]
[64010,"PS","CES Public Services","CES","PS",64010,"3330PS",333000,200001]
[64011,"PS","CES Public Services","CES","PS",64011,"3330PS",333000,200001]
[64012,"PS","CES Public Services","CES","PS",64012,"3330PS",333000,200001]
[{"$f":"IF(F2932>0,VALUE(F2932),\" \")","v":64013},{"$f":"IF(A2932<>\" \",RIGHT(G2932,2),\" \")","v":"PS"},{"$f":"IF(A2932<>\" \",VLOOKUP(H2932,ALLOC_NCHEMS,2,0),\" \")","v":"CES Public Services"},{"$f":"IF(A2932<>\" \",VLOOKUP(I2932,ALLOC,2,0),\" \")","v":"CES"},"PS",64013,"3330PS",333000,200001]
[64014,"PS","CES Public Services","CES","PS",64014,"3330PS",333000,200001]
[64015,"PS","CES Public Services","CES","PS",64015,"3330PS",333000,200001]
[64016,"PS","CES Public Services","CES","PS",64016,"3330PS",333000,200001]
[64017,"PD","CES Public Services","CES","PS",64017,"3330PD",333000,200001]
[64018,"PS","CES Public Services","CES","PS",64018,"3330PS",333000,200001]
[64019,"PS","CES Public Services","CES","PS",64019,"3330PS",333000,200001]
[64020,"PS","CES Public Services","CES","PS",64020,"3330PS",333000,200001]
[64021,"IN","CES Instruction","CES","I",64021,"3310IN",331000,200001]
[64022,"PS","CES Public Services","CES","PS",64022,"3330PS",333000,200001]
[64023,"PD","CES Public Services","CES","PS",64023,"3330PD",333000,200001]
[64024,"PD","CES Public Services","CES","PS",64024,"3330PD",333000,200001]
[64025,"PS","CES Public Services","CES","PS",64025,"3330PS",333000,200001]
[64026,"PS","CES Public Services","CES","PS",64026,"3330PS",333000,200001]
[64027,"PS","CES Public Services","CES","PS",64027,"3330PS",333000,200001]
[64028,"PS","CES Public Services","CES",{"$f":"IF(A2947<>\" \",VLOOKUP(B2947,NCHEMS_ABBR,3,0),\" \")","v":"PS"},64028,"3330PS",333000,200001]
[64029,"PS","CES Public Services","CES","PS",64029,"3330PS",333000,200001]
[64030,"PS","CES Public Services","CES","PS",64030,"3330PS",333000,200001]
[64031,"PS","CES Public Services","CES","PS",64031,"3330PS",333000,200001]
[64032,"PS","CES Public Services","CES","PS",64032,"3330PS",333000,200001]
[64033,"PS","CES Public Services","CES","PS",64033,"3330PS",333000,200001]
[64034,"PS","CES Public Services","CES","PS",64034,"3330PS",333000,200001]
[64035,"PS","CES Public Services","CES","PS",64035,"3330PS",333000,200001]
[64036,"PS","CES Public Services","CES","PS",64036,"3330PS",333000,200001]
[64037,"PS","CES Public Services","CES","PS",64037,"3330PS",333000,200001]
[64038,"PS","CES Public Services","CES","PS",64038,"3330PS",333000,200001]
[64039,"PS","CES Public Services","CES","PS",64039,"3330PS",333000,200001]
[64040,"PS","CES Public Services","CES","PS",64040,"3330PS",333000,200001]
[64041,"PS","CES Public Services","CES","PS",64041,"3330PS",333000,200001]
[64042,"PS","CES Public Services","CES","PS",64042,"3330PS",333000,200001]
[64043,"PS","CES Public Services","CES","PS",64043,"3330PS",333000,200001]
[64044,"PS","CES Public Services","CES","PS",64044,"3330PS",333000,200001]
[64045,"PS","CES Public Services","CES","PS",64045,"3330PS",333000,200001]
[64046,"PS","CES Public Services","CES","PS",64046,"3330PS",333000,200001]
[64047,"PS","CES Public Services","CES","PS",64047,"3330PS",333000,200001]
[64048,"PS","CES Public Services","CES","PS",64048,"3330PS",333000,200001]
[64049,"PS","CES Public Services","CES","PS",64049,"3330PS",333000,200001]
[64050,"PS","CES Public Services","CES","PS",64050,"3330PS",333000,200001]
[64051,"PD","CES Public Services","CES","PS",64051,"3330PD",333000,200001]
[64052,"PS","CES Public Services","CES","PS",64052,"3330PS",333000,200001]
[64053,"PS","CES Public Services","CES","PS",64053,"3330PS",333000,200001]
[64054,"PS","CES Public Services","CES","PS",64054,"3330PS",333000,200001]
[64055,"PS","CES Public Services","CES","PS",64055,"3330PS",333000,200001]
[64056,"PS","CES Public Services","CES","PS",64056,"3330PS",333000,200001]
[64057,"PS","CES Public Services","CES","PS",64057,"3330PS",333000,200001]
[64058,"PS","CES Public Services","CES","PS",64058,"3330PS",333000,200001]
[64059,"PS","CES Public Services","CES","PS",64059,"3330PS",333000,200001]
[64060,"PS","CES Public Services","CES","PS",64060,"3330PS",333000,200001]
[64061,"PS","CES Public Services","CES","PS",64061,"3330PS",333000,200001]
[64062,"PS","CES Public Services","CES","PS",64062,"3330PS",333000,200001]
[64063,"PS","CES Public Services","CES","PS",64063,"3330PS",333000,200001]
[64064,"PS","CES Public Services","CES","PS",64064,"3330PS",333000,200001]
[64065,"PS","CES Public Services","CES","PS",64065,"3330PS",333000,200001]
[64066,"PS","CES Public Services","CES","PS",64066,"3330PS",333000,200001]
[64067,"PS","CES Public Services","CES","PS",64067,"3330PS",333000,200001]
[64068,"PS","CES Public Services","CES","PS",64068,"3330PS",333000,200001]
[64069,"PS","CES Public Services","CES","PS",64069,"3330PS",333000,200001]
[64070,"PS","CES Public Services","CES","PS",64070,"3330PS",333000,200001]
[64071,"PS","CES Public Services","CES","PS",64071,"3330PS",333000,200001]
[64072,"PS","CES Public Services","CES","PS",64072,"3330PS",333000,200001]
[64073,"PS","CES Public Services","CES","PS",64073,"3330PS",333000,200001]
[64074,"PS","CES Public Services","CES","PS",64074,"3330PS",333000,200001]
[64075,"PS","CES Public Services","CES","PS",64075,"3330PS",333000,200001]
[64076,"PS","CES Public Services","CES","PS",64076,"3330PS",333000,200001]
[{"$f":"IF(F2996>0,VALUE(F2996),\" \")","v":64077},{"$f":"IF(A2996<>\" \",RIGHT(G2996,2),\" \")","v":"PS"},{"$f":"IF(A2996<>\" \",VLOOKUP(H2996,ALLOC_NCHEMS,2,0),\" \")","v":"CES Public Services"},{"$f":"IF(A2996<>\" \",VLOOKUP(I2996,ALLOC,2,0),\" \")","v":"CES"},"PS",64077,"3330PS",333000,200001]
[64078,"PS","CES Public Services","CES","PS",64078,"3330PS",333000,200001]
[64079,"PS","CES Public Services","CES","PS",64079,"3330PS",333000,200001]
[64080,"PS","CES Public Services","CES","PS",64080,"3330PS",333000,200001]
[64081,"PS","CES Public Services","CES","PS",64081,"3330PS",333000,200001]
[64082,"PS","CES Public Services","CES","PS",64082,"3330PS",333000,200001]
[64083,"PS","CES Public Services","CES","PS",64083,"3330PS",333000,200001]
[64084,"PS","CES Public Services","CES","PS",64084,"3330PS",333000,200001]
[64085,"PS","CES Public Services","CES","PS",64085,"3330PS",333000,200001]
[64086,"PS","CES Public Services","CES","PS",64086,"3330PS",333000,200001]
[64087,"PS","CES Public Services","CES","PS",64087,"3330PS",333000,200001]
[64088,"PS","CES Public Services","CES","PS",64088,"3330PS",333000,200001]
[64089,"PS","CES Public Services","CES","PS",64089,"3330PS",333000,200001]
[64090,"PD","CES Public Services","CES","PS",64090,"3330PD",333000,200001]
[64091,"PS","CES Public Services","CES","PS",64091,"3330PS",333000,200001]
[64092,"PS","CES Public Services","CES",{"$f":"IF(A3011<>\" \",VLOOKUP(B3011,NCHEMS_ABBR,3,0),\" \")","v":"PS"},64092,"3330PS",333000,200001]
[64093,"PS","CES Public Services","CES","PS",64093,"3330PS",333000,200001]
[64094,"PS","CES Public Services","CES","PS",64094,"3330PS",333000,200001]
[64095,"PS","CES Public Services","CES","PS",64095,"3330PS",333000,200001]
[64096,"PS","CES Public Services","CES","PS",64096,"3330PS",333000,200001]
[64097,"PS","CES Public Services","CES","PS",64097,"3330PS",333000,200001]
[64098,"PM","CES Public Services","CES","PS",64098,"3330PM",333000,200001]
[64099,"PS","CES Public Services","CES","PS",64099,"3330PS",333000,200001]
[64100,"PD","CES Public Services","CES","PS",64100,"3330PD",333000,200001]
[64101,"PS","CES Public Services","CES","PS",64101,"3330PS",333000,200001]
[64102,"PS","CES Public Services","CES","PS",64102,"3330PS",333000,200001]
[64103,"PS","CES Public Services","CES","PS",64103,"3330PS",333000,200001]
[64104,"PS","CES Public Services","CES","PS",64104,"3330PS",333000,200001]
[64105,"PS","CES Public Services","CES","PS",64105,"3330PS",333000,200001]
[64106,"PS","CES Public Services","CES","PS",64106,"3330PS",333000,200001]
[64107,"PS","CES Public Services","CES","PS",64107,"3330PS",333000,200001]
[64108,"FA","CES Student Aid","CES","FA",64108,"3380FA",338000,200001]
[64109,"IN","CES Instruction","CES","I",64109,"3310IN",331000,200001]
[64110,"PS","CES Public Services","CES","PS",64110,"3330PS",333000,200001]
[64111,"PS","CES Public Services","CES","PS",64111,"3330PS",333000,200001]
[64112,"PS","CES Public Services","CES","PS",64112,"3330PS",333000,200001]
[64113,"PS","CES Public Services","CES","PS",64113,"3330PS",333000,200001]
[64114,"PS","CES Public Services","CES","PS",64114,"3330PS",333000,200001]
[64115,"PS","CES Public Services","CES","PS",64115,"3330PS",333000,200001]
[64116,"PS","CES Public Services","CES","PS",64116,"3330PS",333000,200001]
[64117,"PS","CES Public Services","CES","PS",64117,"3330PS",333000,200001]
[64118,"PS","CES Public Services","CES","PS",64118,"3330PS",333000,200001]
[64119,"PS","CES Public Services","CES","PS",64119,"3330PS",333000,200001]
[64120,"PD","CES Public Services","CES","PS",64120,"3330PD",333000,200001]
[64121,"PS","CES Public Services","CES","PS",64121,"3330PS",333000,200001]
[64122,"PS","CES Public Services","CES","PS",64122,"3330PS",333000,200001]
[64123,"PS","CES Public Services","CES","PS",64123,"3330PS",333000,200001]
[64124,"PS","CES Public Services","CES","PS",64124,"3330PS",333000,200001]
[64125,"RO","CES Research","CES","R",64125,"3320RO",332000,200001]
[64126,"PS","CES Public Services","CES","PS",64126,"3330PS",333000,200001]
[64127,"PS","CES Public Services","CES","PS",64127,"3330PS",333000,200001]
[64128,"PS","CES Public Services","CES","PS",64128,"3330PS",333000,200001]
[64130,"PS","CES Public Services","CES","PS",64130,"3330PS",333000,200001]
[64131,"PS","CES Public Services","CES","PS",64131,"3330PS",333000,200001]
[64132,"PS","CES Public Services","CES","PS",64132,"3330PS",333000,200001]
[64133,"PS","CES Public Services","CES","PS",64133,"3330PS",333000,200001]
[64134,"PS","CES Public Services","CES","PS",64134,"3330PS",333000,200001]
[64135,"PS","CES Public Services","CES","PS",64135,"3330PS",333000,200001]
[64136,"PS","CES Public Services","CES","PS",64136,"3330PS",333000,200001]
[64137,"PS","CES Public Services","CES","PS",64137,"3330PS",333000,200001]
[64139,"PS","CES Public Services","CES","PS",64139,"3330PS",333000,200001]
[64140,"PS","CES Public Services","CES","PS",64140,"3330PS",333000,200001]
[64141,"PS","CES Public Services","CES","PS",64141,"3330PS",333000,200001]
[64142,"PS","CES Public Services","CES","PS",64142,"3330PS",333000,200001]
[{"$f":"IF(F3060>0,VALUE(F3060),\" \")","v":64143},{"$f":"IF(A3060<>\" \",RIGHT(G3060,2),\" \")","v":"PS"},{"$f":"IF(A3060<>\" \",VLOOKUP(H3060,ALLOC_NCHEMS,2,0),\" \")","v":"CES Public Services"},{"$f":"IF(A3060<>\" \",VLOOKUP(I3060,ALLOC,2,0),\" \")","v":"CES"},"PS",64143,"3330PS",333000,200001]
[64144,"PS","CES Public Services","CES","PS",64144,"3330PS",333000,200001]
[64145,"PS","CES Public Services","CES","PS",64145,"3330PS",333000,200001]
[64146,"PS","CES Public Services","CES","PS",64146,"3330PS",333000,200001]
[64147,"PS","CES Public Services","CES","PS",64147,"3330PS",333000,200001]
[64150,"PS","CES Public Services","CES","PS",64150,"3330PS",333000,200001]
[64151,"PS","CES Public Services","CES","PS",64151,"3330PS",333000,200001]
[64152,"PS","CES Public Services","CES","PS",64152,"3330PS",333000,200001]
[64153,"PS","CES Public Services","CES","PS",64153,"3330PS",333000,200001]
[64154,"PS","CES Public Services","CES","PS",64154,"3330PS",333000,200001]
[64155,"PS","CES Public Services","CES","PS",64155,"3330PS",333000,200001]
[64160,"RO","CES Research","CES","R",64160,"3320RO",332000,200001]
[64161,"PD","CES Public Services","CES","PS",64161,"3330PD",333000,200001]
[64170,"PS","CES Public Services","CES","PS",64170,"3330PS",333000,200001]
[64171,"PS","CES Public Services","CES","PS",64171,"3330PS",333000,200001]
[64172,"PS","CES Public Services","CES",{"$f":"IF(A3075<>\" \",VLOOKUP(B3075,NCHEMS_ABBR,3,0),\" \")","v":"PS"},64172,"3330PS",333000,200001]
[64173,"PD","CES Public Services","CES","PS",64173,"3330PD",333000,200001]
[64174,"PS","CES Public Services","CES","PS",64174,"3330PS",333000,200001]
[64179,"PS","CES Public Services","CES","PS",64179,"3330PS",333000,200001]
[64186,"PD","CES Public Services","CES","PS",64186,"3330PD",333000,200001]
[64188,"PD","CES Public Services","CES","PS",64188,"3330PD",333000,200001]
[64189,"PD","CES Public Services","CES","PS",64189,"3330PD",333000,200001]
[64191,"PD","CES Public Services","CES","PS",64191,"3330PD",333000,200001]
[64192,"PS","CES Public Services","CES","PS",64192,"3330PS",333000,200001]
[64194,"PD","CES Public Services","CES","PS",64194,"3330PD",333000,200001]
[64196,"PD","CES Public Services","CES","PS",64196,"3330PD",333000,200001]
[64197,"PD","CES Public Services","CES","PS",64197,"3330PD",333000,200001]
[64200,"PM","CES Public Services","CES","PS",64200,"3330PM",333000,200001]
[64239,"PS","CES Public Services","CES","PS",64239,"3330PS",333000,200001]
[64292,"PD","CES Public Services","CES","PS",64292,"3330PD",333000,200001]
[64339,"PS","CES Public Services","CES","PS",64339,"3330PS",333000,200001]
[64439,"PS","CES Public Services","CES","PS",64439,"3330PS",333000,200001]
[64999,"PS","CES Public Services","CES","PS",64999,"3330PS",333000,200001]
[65000,"IN","FC Instruction","FC","I",65000,"3016IN",301000,300001]
[65001,"ID","FC Instruction","FC","I",65001,"3016ID",301000,300001]
[65002,"IN","FC Instruction","FC","I",65002,"3016IN",301000,300001]
[65003,"ID","FC Instruction","FC","I",65003,"3016ID",301000,300001]
[65004,"IN","FC Instruction","FC","I",65004,"3016IN",301000,300001]
[65005,"IR","FC Instruction","FC","I",65005,"3016IR",301000,300001]
[65006,"IN","FC Instruction","FC","I",65006,"3016IN",301000,300001]
[65007,"RD","FC Research","FC","R",65007,"3016RD",302000,300001]
[65008,"RD","FC Research","FC","R",65008,"3016RD",302000,300001]
[65009,"RO","FC Research","FC","R",65009,"3016RO",302000,300001]
[65010,"IN","FC Instruction","FC","I",65010,"3016IN",301000,300001]
[65011,"ID","FC Instruction","FC","I",65011,"3016ID",301000,300001]
[65012,"IN","FC Instruction","FC","I",65012,"3016IN",301000,300001]
[65013,"IN","FC Instruction","FC","I",65013,"3016IN",301000,300001]
[65014,"IN","FC Instruction","FC","I",65014,"3016IN",301000,300001]
[65015,"IN","FC Instruction","FC","I",65015,"3016IN",301000,300001]
[65016,"ID","FC Instruction","FC","I",65016,"3016ID",301000,300001]
[65017,"IN","FC Instruction","FC","I",65017,"3016IN",301000,300001]
[65018,"IN","FC Instruction","FC","I",65018,"3016IN",301000,300001]
[65019,"AS","FC Academic Support","FC","AS",65019,"3047AS",304000,300001]
[65020,"AS","FC Academic Support","FC","AS",65020,"3047AS",304000,300001]
[65021,"AS","FC Academic Support","FC","AS",65021,"3047AS",304000,300001]
[65022,"AM","FC Academic Support","FC","AS",65022,"3040AM",304000,300001]
[65023,"AM","FC Academic Support","FC","AS",65023,"3040AM",304000,300001]
[65024,"AM","FC Academic Support","FC","AS",65024,"3040AM",304000,300001]
[65025,"AM","FC Academic Support","FC","AS",65025,"3040AM",304000,300001]
[65026,"AM","FC Academic Support","FC","AS",65026,"3040AM",304000,300001]
[65027,"AM","FC Academic Support","FC","AS",65027,"3040AM",304000,300001]
[65028,"AM","FC Academic Support","FC","AS",65028,"3040AM",304000,300001]
[65029,"AM","FC Academic Support","FC","AS",65029,"3040AM",304000,300001]
[65030,"AM","FC Academic Support","FC","AS",65030,"3040AM",304000,300001]
[{"$f":"IF(F3124>0,VALUE(F3124),\" \")","v":65031},{"$f":"IF(A3124<>\" \",RIGHT(G3124,2),\" \")","v":"AM"},{"$f":"IF(A3124<>\" \",VLOOKUP(H3124,ALLOC_NCHEMS,2,0),\" \")","v":"FC Academic Support"},{"$f":"IF(A3124<>\" \",VLOOKUP(I3124,ALLOC,2,0),\" \")","v":"FC"},"AS",65031,"3040AM",304000,300001]
[65032,"AM","FC Academic Support","FC","AS",65032,"3040AM",304000,300001]
[65033,"AM","FC Academic Support","FC","AS",65033,"3040AM",304000,300001]
[65034,"AM","FC Academic Support","FC","AS",65034,"3040AM",304000,300001]
[65035,"AM","FC Academic Support","FC","AS",65035,"3040AM",304000,300001]
[65036,"AM","FC Academic Support","FC","AS",65036,"3040AM",304000,300001]
[65037,"PS","FC Public Service","FC","PS",65037,"303APS",303000,300001]
[65038,"AM","FC Academic Support","FC","AS",65038,"3040AM",304000,300001]
[65039,"AM","FC Academic Support","FC","AS",65039,"3040AM",304000,300001]
[65040,"AM","FC Academic Support","FC","AS",65040,"3040AM",304000,300001]
[65041,"AM","FC Academic Support","FC","AS",65041,"3040AM",304000,300001]
[65042,"AS","FC Academic Support","FC","AS",65042,"3040AS",304000,300001]
[65043,"PS","FC Public Service","FC","PS",65043,"303APS",303000,300001]
[65044,"AM","FC Academic Support","FC","AS",65044,"3040AM",304000,300001]
[65045,"AM","FC Academic Support","FC","AS",65045,"3040AM",304000,300001]
[65046,"RO","FOR Research","FOR",{"$f":"IF(A3139<>\" \",VLOOKUP(B3139,NCHEMS_ABBR,3,0),\" \")","v":"R"},65046,"382DRO",382000,300002]
[65047,"AM","FC Academic Support","FC","AS",65047,"3040AM",304000,300001]
[65048,"AM","FC Academic Support","FC","AS",65048,"3040AM",304000,300001]
[65049,"AM","FC Academic Support","FC","AS",65049,"3040AM",304000,300001]
[65050,"AM","FC Academic Support","FC","AS",65050,"3040AM",304000,300001]
[65051,"AM","FC Academic Support","FC","AS",65051,"3040AM",304000,300001]
[65052,"AM","FC Academic Support","FC","AS",65052,"3040AM",304000,300001]
[65053,"AM","FC Academic Support","FC","AS",65053,"3040AM",304000,300001]
[65054,"AM","FC Academic Support","FC","AS",65054,"3040AM",304000,300001]
[65055,"RO","FOR Research","FOR","R",65055,"382DRO",382000,300002]
[65056,"RO","FC Research","FC","R",65056,"3016RO",302000,300001]
[65057,"RO","FC Research","FC","R",65057,"3016RO",302000,300001]
[65058,"IR","FC Instruction","FC","I",65058,"3016IR",301000,300001]
[65059,"RO","FC Research","FC","R",65059,"3016RO",302000,300001]
[65060,"RO","FC Research","FC","R",65060,"3016RO",302000,300001]
[65061,"IY","FC Instruction","FC","I",65061,"3016IY",301000,300001]
[65062,"IN","FC Instruction","FC","I",65062,"3016IN",301000,300001]
[65063,"IY","FC Instruction","FC","I",65063,"3016IY",301000,300001]
[65064,"RO","FC Research","FC","R",65064,"3016RO",302000,300001]
[65065,"IN","FC Instruction","FC","I",65065,"3016IN",301000,300001]
[65066,"RT","FC Research","FC","R",65066,"3020RT",302000,300001]
[65067,"PS","FC Public Service","FC","PS",65067,"3036PS",303000,300001]
[65068,"IN","FC Instruction","FC","I",65068,"3016IN",301000,300001]
[65069,"ID","FC Instruction","FC","I",65069,"3016ID",301000,300001]
[65070,"RO","FC Research","FC","R",65070,"3016RO",302000,300001]
[65071,"IN","FC Instruction","FC","I",65071,"3016IN",301000,300001]
[65072,"IN","FC Instruction","FC","I",65072,"3016IN",301000,300001]
[65073,"IN","FC Instruction","FC","I",65073,"3016IN",301000,300001]
[65074,"ID","FC Instruction","FC","I",65074,"3016ID",301000,300001]
[65075,"RO","FC Research","FC","R",65075,"3016RO",302000,300001]
[65076,"IY","FC Instruction","FC","I",65076,"3016IY",301000,300001]
[65077,"IY","FC Instruction","FC","I",65077,"3016IY",301000,300001]
[65078,"IY","FC Instruction","FC","I",65078,"3016IY",301000,300001]
[65079,"IY","FC Instruction","FC","I",65079,"3016IY",301000,300001]
[65080,"RO","FC Research","FC","R",65080,"3016RO",302000,300001]
[65081,"IN","FC Instruction","FC","I",65081,"3016IN",301000,300001]
[65082,"IN","FC Instruction","FC","I",65082,"3016IN",301000,300001]
[65083,"IN","FC Instruction","FC","I",65083,"3016IN",301000,300001]
[65084,"ID","FC Instruction","FC","I",65084,"3016ID",301000,300001]
[65085,"IN","FC Instruction","FC","I",65085,"3016IN",301000,300001]
[65086,"IN","FC Instruction","FC","I",65086,"3016IN",301000,300001]
[65087,"IN","FC Instruction","FC","I",65087,"3016IN",301000,300001]
[65088,"IN","FC Instruction","FC","I",65088,"3016IN",301000,300001]
[65089,"IR","FC Instruction","FC","I",65089,"3016IR",301000,300001]
[65090,"IR","FC Instruction","FC","I",65090,"3016IR",301000,300001]
[65091,"ID","FC Instruction","FC","I",65091,"3016ID",301000,300001]
[65092,"IN","FC Instruction","FC","I",65092,"3016IN",301000,300001]
[65093,"ID","FC Instruction","FC","I",65093,"3016ID",301000,300001]
[65095,"RO","FC Research","FC","R",65095,"3016RO",302000,300001]
[{"$f":"IF(F3188>0,VALUE(F3188),\" \")","v":65096},{"$f":"IF(A3188<>\" \",RIGHT(G3188,2),\" \")","v":"IN"},{"$f":"IF(A3188<>\" \",VLOOKUP(H3188,ALLOC_NCHEMS,2,0),\" \")","v":"FC Instruction"},{"$f":"IF(A3188<>\" \",VLOOKUP(I3188,ALLOC,2,0),\" \")","v":"FC"},"I",65096,"3016IN",301000,300001]
[65097,"IN","FC Instruction","FC","I",65097,"3016IN",301000,300001]
[65098,"ID","FC Instruction","FC","I",65098,"3016ID",301000,300001]
[65099,"FA","FC Scholarships","FC","FA",65099,"3085FA",308000,300001]
[65101,"RO","FOR Research","FOR","R",65101,"382DRO",382000,300002]
[65102,"RO","FOR Research","FOR","R",65102,"382DRO",382000,300002]
[65103,"RO","FOR Research","FOR","R",65103,"382DRO",382000,300002]
[65104,"RO","FOR Research","FOR","R",65104,"382DRO",382000,300002]
[65105,"RO","FOR Research","FOR","R",65105,"382DRO",382000,300002]
[65106,"RO","FOR Research","FOR","R",65106,"382DRO",382000,300002]
[65107,"RO","FOR Research","FOR","R",65107,"382DRO",382000,300002]
[65108,"RO","FOR Research","FOR","R",65108,"382DRO",382000,300002]
[65109,"RO","FOR Research","FOR","R",65109,"382DRO",382000,300002]
[65110,"RO","FOR Research","FOR","R",65110,"382DRO",382000,300002]
[65111,"AM","FC Academic Support","FC","AS",65111,"3040AM",304000,300001]
[65112,"AZ","FC Academic Support","FC",{"$f":"IF(A3203<>\" \",VLOOKUP(B3203,NCHEMS_ABBR,3,0),\" \")","v":"AS"},65112,"3040AZ",304000,300001]
[65113,"AP","FC Academic Support","FC","AS",65113,"3040AP",304000,300001]
[65114,"RT","FOR Research","FOR","R",65114,"382DRT",382000,300002]
[65115,"FA","FC Scholarships","FC","FA",65115,"3040FA",308000,300001]
[65200,"RO","FC Research","FC","R",65200,"3016RO",302000,300001]
[65201,"IR","FC Instruction","FC","I",65201,"3016IR",301000,300001]
[65202,"PS","FC Public Service","FC","PS",65202,"3036PS",303000,300001]
[65203,"RO","FC Research","FC","R",65203,"3016RO",302000,300001]
[65204,"IN","FC Instruction","FC","I",65204,"3016IN",301000,300001]
[65205,"PS","FC Public Service","FC","PS",65205,"3036PS",303000,300001]
[65206,"RD","FC Research","FC","R",65206,"3016RD",302000,300001]
[65207,"PS","FC Public Service","FC","PS",65207,"3036PS",303000,300001]
[65208,"IN","FC Instruction","FC","I",65208,"3016IN",301000,300001]
[65209,"IN","FC Instruction","FC","I",65209,"3016IN",301000,300001]
[65210,"IN","FC Instruction","FC","I",65210,"3016IN",301000,300001]
[65211,"IN","FC Instruction","FC","I",65211,"3016IN",301000,300001]
[65212,"FA","FC Scholarships","FC","FA",65212,"3085FA",308000,300001]
[65213,"RO","FC Research","FC","R",65213,"3016RO",302000,300001]
[65214,"RO","FC Research","FC","R",65214,"3016RO",302000,300001]
[65215,"IR","FC Instruction","FC","I",65215,"3016IR",301000,300001]
[65216,"IR","FC Instruction","FC","I",65216,"3016IR",301000,300001]
[65217,"IR","FC Instruction","FC","I",65217,"3016IR",301000,300001]
[65218,"FA","FC Scholarships","FC","FA",65218,"3085FA",308000,300001]
[65219,"IR","FC Instruction","FC","I",65219,"3016IR",301000,300001]
[65220,"IN","FC Instruction","FC","I",65220,"3016IN",301000,300001]
[65221,"IR","FC Instruction","FC","I",65221,"3016IR",301000,300001]
[65222,"ID","FC Instruction","FC","I",65222,"3016ID",301000,300001]
[65223,"IR","FC Instruction","FC","I",65223,"3016IR",301000,300001]
[65224,"ID","FC Instruction","FC","I",65224,"3016ID",301000,300001]
[65225,"IN","FC Instruction","FC","I",65225,"3013IN",301000,300001]
[65226,"ID","FC Instruction","FC","I",65226,"3013ID",301000,300001]
[65227,"IN","FC Instruction","FC","I",65227,"3016IN",301000,300001]
[65228,"IN","FC Instruction","FC","I",65228,"3013IN",301000,300001]
[65229,"IR","FC Instruction","FC","I",65229,"3016IR",301000,300001]
[65230,"RO","FC Research","FC","R",65230,"3016RO",302000,300001]
[65231,"RO","FC Research","FC","R",65231,"3016RO",302000,300001]
[65232,"RO","FC Research","FC","R",65232,"3016RO",302000,300001]
[65233,"RO","FC Research","FC","R",65233,"3016RO",302000,300001]
[65234,"RO","FC Research","FC","R",65234,"3016RO",302000,300001]
[65235,"IR","FC Instruction","FC","I",65235,"3016IR",301000,300001]
[65236,"IR","FC Instruction","FC","I",65236,"3016IR",301000,300001]
[65237,"ID","FC Instruction","FC","I",65237,"3016ID",301000,300001]
[65238,"IN","FC Instruction","FC","I",65238,"3016IN",301000,300001]
[65239,"IR","FC Instruction","FC","I",65239,"3016IR",301000,300001]
[65240,"RO","FC Research","FC","R",65240,"3016RO",302000,300001]
[65241,"RO","FC Research","FC","R",65241,"3016RO",302000,300001]
[65242,"IR","FC Instruction","FC","I",65242,"3016IR",301000,300001]
[65243,"RO","FC Research","FC","R",65243,"3016RO",302000,300001]
[65244,"IR","FC Instruction","FC","I",65244,"3016IR",301000,300001]
[{"$f":"IF(F3252>0,VALUE(F3252),\" \")","v":65245},{"$f":"IF(A3252<>\" \",RIGHT(G3252,2),\" \")","v":"PS"},{"$f":"IF(A3252<>\" \",VLOOKUP(H3252,ALLOC_NCHEMS,2,0),\" \")","v":"FC Public Service"},{"$f":"IF(A3252<>\" \",VLOOKUP(I3252,ALLOC,2,0),\" \")","v":"FC"},"PS",65245,"3036PS",303000,300001]
[65246,"AS","FC Academic Support","FC","AS",65246,"3047AS",304000,300001]
[65247,"RO","FC Research","FC","R",65247,"3016RO",302000,300001]
[65248,"IR","FC Instruction","FC","I",65248,"3016IR",301000,300001]
[65250,"RO","FC Research","FC","R",65250,"3016RO",302000,300001]
[65251,"RO","FC Research","FC","R",65251,"3016RO",302000,300001]
[65252,"RO","FC Research","FC","R",65252,"3016RO",302000,300001]
[65253,"PS","FC Public Service","FC","PS",65253,"3036PS",303000,300001]
[65254,"IR","FC Instruction","FC","I",65254,"3016IR",301000,300001]
[65255,"IR","FC Instruction","FC","I",65255,"3016IR",301000,300001]
[65256,"RO","FC Research","FC","R",65256,"3016RO",302000,300001]
[65257,"IR","FC Instruction","FC","I",65257,"3016IR",301000,300001]
[65258,"RO","FC Research","FC","R",65258,"3016RO",302000,300001]
[65260,"RO","FC Research","FC","R",65260,"3016RO",302000,300001]
[65261,"IR","FC Instruction","FC","I",65261,"3016IR",301000,300001]
[65270,"IR","FC Instruction","FC",{"$f":"IF(A3267<>\" \",VLOOKUP(B3267,NCHEMS_ABBR,3,0),\" \")","v":"I"},65270,"3016IR",301000,300001]
[65271,"FA","FC Scholarships","FC","FA",65271,"3085FA",308000,300001]
[65272,"RT","FC Research","FC","R",65272,"3020RT",302000,300001]
[65273,"ID","FC Instruction","FC","I",65273,"3016ID",301000,300001]
[65274,"FA","FC Scholarships","FC","FA",65274,"3085FA",308000,300001]
[65275,"IR","FC Instruction","FC","I",65275,"3016IR",301000,300001]
[65278,"RO","FC Research","FC","R",65278,"3016RO",302000,300001]
[65279,"IR","FC Instruction","FC","I",65279,"3016IR",301000,300001]
[65280,"RD","FC Research","FC","R",65280,"3016RD",302000,300001]
[65281,"RD","FC Research","FC","R",65281,"3016RD",302000,300001]
[65282,"RO","FC Research","FC","R",65282,"3016RO",302000,300001]
[65283,"IR","FC Instruction","FC","I",65283,"3016IR",301000,300001]
[65290,"IR","FC Instruction","FC","I",65290,"3016IR",301000,300001]
[65291,"RO","FC Research","FC","R",65291,"3016RO",302000,300001]
[65292,"ID","FC Instruction","FC","I",65292,"3016ID",301000,300001]
[65293,"RO","FC Research","FC","R",65293,"3016RO",302000,300001]
[65294,"IN","FC Instruction","FC","I",65294,"3016IN",301000,300001]
[65295,"IR","FC Instruction","FC","I",65295,"3016IR",301000,300001]
[65296,"RO","FC Research","FC","R",65296,"3016RO",302000,300001]
[65297,"IR","FC Instruction","FC","I",65297,"3016IR",301000,300001]
[65298,"IR","FC Instruction","FC","I",65298,"3016IR",301000,300001]
[65300,"RO","FC Research","FC","R",65300,"3016RO",302000,300001]
[65301,"IR","FC Instruction","FC","I",65301,"3016IR",301000,300001]
[65302,"RO","FC Research","FC","R",65302,"3016RO",302000,300001]
[65303,"IR","FC Instruction","FC","I",65303,"3016IR",301000,300001]
[65304,"RO","FC Research","FC","R",65304,"3016RO",302000,300001]
[65305,"IR","FC Instruction","FC","I",65305,"3016IR",301000,300001]
[65306,"RO","FC Research","FC","R",65306,"3016RO",302000,300001]
[65307,"RO","FC Research","FC","R",65307,"3016RO",302000,300001]
[65308,"RO","FC Research","FC","R",65308,"3016RO",302000,300001]
[65309,"RO","FC Research","FC","R",65309,"3016RO",302000,300001]
[65310,"RO","FC Research","FC","R",65310,"3016RO",302000,300001]
[65311,"IR","FC Instruction","FC","I",65311,"3016IR",301000,300001]
[65312,"IR","FC Instruction","FC","I",65312,"3016IR",301000,300001]
[65313,"IR","FC Instruction","FC","I",65313,"3016IR",301000,300001]
[65314,"RO","FC Research","FC","R",65314,"3016RO",302000,300001]
[65315,"FA","FC Scholarships","FC","FA",65315,"3085FA",308000,300001]
[65316,"RO","FC Research","FC","R",65316,"3016RO",302000,300001]
[65317,"IR","FC Instruction","FC","I",65317,"3016IR",301000,300001]
[65318,"RO","FC Research","FC","R",65318,"3016RO",302000,300001]
[65319,"IR","FC Instruction","FC","I",65319,"3016IR",301000,300001]
[65320,"RO","FC Research","FC","R",65320,"3016RO",302000,300001]
[65321,"IR","FC Instruction","FC","I",65321,"3016IR",301000,300001]
[65322,"RO","FC Research","FC","R",65322,"3016RO",302000,300001]
[65323,"IR","FC Instruction","FC","I",65323,"3016IR",301000,300001]
[65324,"RO","FC Research","FC","R",65324,"3016RO",302000,300001]
[65325,"IR","FC Instruction","FC","I",65325,"3016IR",301000,300001]
[65326,"RO","FC Research","FC","R",65326,"3016RO",302000,300001]
[65327,"IR","FC Instruction","FC","I",65327,"3016IR",301000,300001]
[{"$f":"IF(F3316>0,VALUE(F3316),\" \")","v":65501},{"$f":"IF(A3316<>\" \",RIGHT(G3316,2),\" \")","v":"RD"},{"$f":"IF(A3316<>\" \",VLOOKUP(H3316,ALLOC_NCHEMS,2,0),\" \")","v":"FOR Research"},{"$f":"IF(A3316<>\" \",VLOOKUP(I3316,ALLOC,2,0),\" \")","v":"FOR"},"R",65501,"3823RD",382000,300002]
[65502,"RR","FOR Research","FOR","R",65502,"3823RR",382000,300002]
[65503,"RR","FOR Research","FOR","R",65503,"3823RR",382000,300002]
[65504,"RR","FOR Research","FOR","R",65504,"3823RR",382000,300002]
[65505,"RR","FOR Research","FOR","R",65505,"3823RR",382000,300002]
[65506,"RR","FOR Research","FOR","R",65506,"3823RR",382000,300002]
[65507,"RR","FOR Research","FOR","R",65507,"3823RR",382000,300002]
[65508,"RR","FOR Research","FOR","R",65508,"3823RR",382000,300002]
[65509,"RR","FOR Research","FOR","R",65509,"3823RR",382000,300002]
[65510,"RD","FOR Research","FOR","R",65510,"3823RD",382000,300002]
[65511,"RR","FOR Research","FOR","R",65511,"3823RR",382000,300002]
[65512,"PS","FOR Public Service","FOR","PS",65512,"3823PS",383000,300002]
[65513,"RR","FOR Research","FOR","R",65513,"3823RR",382000,300002]
[65514,"RR","FOR Research","FOR","R",65514,"3823RR",382000,300002]
[65515,"RR","FOR Research","FOR","R",65515,"3823RR",382000,300002]
[65516,"RZ","FOR Research","FOR",{"$f":"IF(A3331<>\" \",VLOOKUP(B3331,NCHEMS_ABBR,3,0),\" \")","v":"R"},65516,"3820RZ",382000,300002]
[65517,"RR","FOR Research","FOR","R",65517,"3823RR",382000,300002]
[65518,"RR","FOR Research","FOR","R",65518,"3823RR",382000,300002]
[65519,"RR","FOR Research","FOR","R",65519,"3823RR",382000,300002]
[65520,"RR","FOR Research","FOR","R",65520,"3823RR",382000,300002]
[65521,"RM","FOR Research","FOR","R",65521,"3823RM",382000,300002]
[65522,"RR","FOR Research","FOR","R",65522,"3823RR",382000,300002]
[65523,"RR","FOR Research","FOR","R",65523,"3823RR",382000,300002]
[65524,"RR","FOR Research","FOR","R",65524,"3823RR",382000,300002]
[65525,"RR","FOR Research","FOR","R",65525,"3823RR",382000,300002]
[65526,"RM","FOR Research","FOR","R",65526,"3823RM",382000,300002]
[65527,"RR","FOR Research","FOR","R",65527,"3823RR",382000,300002]
[65528,"RR","FOR Research","FOR","R",65528,"3823RR",382000,300002]
[65529,"RR","FOR Research","FOR","R",65529,"3823RR",382000,300002]
[65530,"RR","FOR Research","FOR","R",65530,"3823RR",382000,300002]
[65531,"RR","FOR Research","FOR","R",65531,"3823RR",382000,300002]
[65532,"RR","FOR Research","FOR","R",65532,"3823RR",382000,300002]
[65533,"RT","FOR Research","FOR","R",65533,"3823RT",382000,300002]
[65534,"RR","FOR Research","FOR","R",65534,"3823RR",382000,300002]
[65535,"RR","FOR Research","FOR","R",65535,"3823RR",382000,300002]
[65536,"RR","FOR Research","FOR","R",65536,"3823RR",382000,300002]
[65537,"RR","FOR Research","FOR","R",65537,"3823RR",382000,300002]
[65538,"RR","FOR Research","FOR","R",65538,"3823RR",382000,300002]
[65539,"RR","FOR Research","FOR","R",65539,"3823RR",382000,300002]
[65540,"RR","FOR Research","FOR","R",65540,"3823RR",382000,300002]
[65541,"RR","FOR Research","FOR","R",65541,"3823RR",382000,300002]
[65542,"RR","FOR Research","FOR","R",65542,"3823RR",382000,300002]
[65543,"RR","FOR Research","FOR","R",65543,"3823RR",382000,300002]
[65544,"RR","FOR Research","FOR","R",65544,"3823RR",382000,300002]
[65545,"RR","FOR Research","FOR","R",65545,"3823RR",382000,300002]
[65546,"RR","FOR Research","FOR","R",65546,"3823RR",382000,300002]
[65547,"RR","FOR Research","FOR","R",65547,"3823RR",382000,300002]
[65548,"RR","FOR Research","FOR","R",65548,"3823RR",382000,300002]
[65549,"RR","FOR Research","FOR","R",65549,"3823RR",382000,300002]
[65550,"RR","FOR Research","FOR","R",65550,"3823RR",382000,300002]
[65551,"RR","FOR Research","FOR","R",65551,"3823RR",382000,300002]
[65552,"RR","FOR Research","FOR","R",65552,"3823RR",382000,300002]
[65553,"RR","FOR Research","FOR","R",65553,"3823RR",382000,300002]
[65554,"RR","FOR Research","FOR","R",65554,"3823RR",382000,300002]
[65555,"RR","FOR Research","FOR","R",65555,"3823RR",382000,300002]
[65556,"RR","FOR Research","FOR","R",65556,"3823RR",382000,300002]
[65557,"RR","FOR Research","FOR","R",65557,"3823RR",382000,300002]
[65558,"RR","FOR Research","FOR","R",65558,"3823RR",382000,300002]
[65559,"RR","FOR Research","FOR","R",65559,"3823RR",382000,300002]
[65560,"RR","FOR Research","FOR","R",65560,"3823RR",382000,300002]
[65561,"RR","FOR Research","FOR","R",65561,"3823RR",382000,300002]
[65562,"RR","FOR Research","FOR","R",65562,"3823RR",382000,300002]
[65563,"RR","FOR Research","FOR","R",65563,"3823RR",382000,300002]
[65564,"RR","FOR Research","FOR","R",65564,"3823RR",382000,300002]
[{"$f":"IF(F3380>0,VALUE(F3380),\" \")","v":65565},{"$f":"IF(A3380<>\" \",RIGHT(G3380,2),\" \")","v":"RR"},{"$f":"IF(A3380<>\" \",VLOOKUP(H3380,ALLOC_NCHEMS,2,0),\" \")","v":"FOR Research"},{"$f":"IF(A3380<>\" \",VLOOKUP(I3380,ALLOC,2,0),\" \")","v":"FOR"},"R",65565,"3823RR",382000,300002]
[65566,"RR","FOR Research","FOR","R",65566,"3823RR",382000,300002]
[65567,"RD","FOR Research","FOR","R",65567,"3823RD",382000,300002]
[65568,"RR","FOR Research","FOR","R",65568,"3823RR",382000,300002]
[65569,"RR","FOR Research","FOR","R",65569,"3823RR",382000,300002]
[65570,"RR","FOR Research","FOR","R",65570,"3823RR",382000,300002]
[65571,"RR","FOR Research","FOR","R",65571,"3823RR",382000,300002]
[65572,"RR","FOR Research","FOR","R",65572,"3823RR",382000,300002]
[65573,"RR","FOR Research","FOR","R",65573,"3823RR",382000,300002]
[65574,"RR","FOR Research","FOR","R",65574,"3823RR",382000,300002]
[65575,"RR","FOR Research","FOR","R",65575,"3823RR",382000,300002]
[65576,"RR","FOR Research","FOR","R",65576,"3823RR",382000,300002]
[65577,"RM","FOR Research","FOR","R",65577,"3823RM",382000,300002]
[65578,"RM","FOR Research","FOR","R",65578,"3823RM",382000,300002]
[65579,"RM","FOR Research","FOR","R",65579,"3823RM",382000,300002]
[65580,"RR","FOR Research","FOR",{"$f":"IF(A3395<>\" \",VLOOKUP(B3395,NCHEMS_ABBR,3,0),\" \")","v":"R"},65580,"3823RR",382000,300002]
[65581,"RR","FOR Research","FOR","R",65581,"3823RR",382000,300002]
[65582,"RR","FOR Research","FOR","R",65582,"3823RR",382000,300002]
[65583,"RR","FOR Research","FOR","R",65583,"3823RR",382000,300002]
[65584,"RR","FOR Research","FOR","R",65584,"3823RR",382000,300002]
[65585,"RY","FOR Research","FOR","R",65585,"3823RY",382000,300002]
[65586,"RY","FOR Research","FOR","R",65586,"3823RY",382000,300002]
[65587,"RR","FOR Research","FOR","R",65587,"3823RR",382000,300002]
[65588,"RR","FOR Research","FOR","R",65588,"3823RR",382000,300002]
[65589,"RR","FOR Research","FOR","R",65589,"3823RR",382000,300002]
[65590,"RY","FOR Research","FOR","R",65590,"3823RY",382000,300002]
[65591,"RR","FOR Research","FOR","R",65591,"3823RR",382000,300002]
[65592,"RY","FOR Research","FOR","R",65592,"3823RY",382000,300002]
[65593,"RR","FOR Research","FOR","R",65593,"3823RR",382000,300002]
[65594,"RM","FOR Research","FOR","R",65594,"3823RM",382000,300002]
[65595,"RY","FOR Research","FOR","R",65595,"3823RY",382000,300002]
[65596,"RR","FOR Research","FOR","R",65596,"3823RR",382000,300002]
[65597,"RR","FOR Research","FOR","R",65597,"3823RR",382000,300002]
[65598,"RR","FOR Research","FOR","R",65598,"3823RR",382000,300002]
[65599,"RR","FOR Research","FOR","R",65599,"3823RR",382000,300002]
[65600,"RY","FOR Research","FOR","R",65600,"3823RY",382000,300002]
[65601,"RY","FOR Research","FOR","R",65601,"3823RY",382000,300002]
[65602,"RY","FOR Research","FOR","R",65602,"3823RY",382000,300002]
[65603,"RR","FOR Research","FOR","R",65603,"3823RR",382000,300002]
[65605,"RY","FOR Research","FOR","R",65605,"3823RY",382000,300002]
[65606,"RY","FOR Research","FOR","R",65606,"3823RY",382000,300002]
[65607,"RD","FOR Research","FOR","R",65607,"3823RD",382000,300002]
[65608,"RD","FOR Research","FOR","R",65608,"3823RD",382000,300002]
[65609,"RR","FOR Research","FOR","R",65609,"3823RR",382000,300002]
[65610,"RR","FOR Research","FOR","R",65610,"3823RR",382000,300002]
[65611,"RY","FOR Research","FOR","R",65611,"3823RY",382000,300002]
[65612,"PS","FOR Public Service","FOR","PS",65612,"3823PS",383000,300002]
[65613,"RR","FOR Research","FOR","R",65613,"3823RR",382000,300002]
[65614,"RR","FOR Research","FOR","R",65614,"3823RR",382000,300002]
[65615,"RR","FOR Research","FOR","R",65615,"3823RR",382000,300002]
[65616,"RT","FOR Research","FOR","R",65616,"3823RT",382000,300002]
[65617,"RR","FOR Research","FOR","R",65617,"3823RR",382000,300002]
[65618,"RT","FOR Research","FOR","R",65618,"3823RT",382000,300002]
[65619,"RR","FOR Research","FOR","R",65619,"3823RR",382000,300002]
[65620,"RR","FOR Research","FOR","R",65620,"3823RR",382000,300002]
[65621,"RR","FOR Research","FOR","R",65621,"3823RR",382000,300002]
[65622,"RT","FOR Research","FOR","R",65622,"3823RT",382000,300002]
[65623,"RR","FOR Research","FOR","R",65623,"3823RR",382000,300002]
[65624,"RT","FOR Research","FOR","R",65624,"3823RT",382000,300002]
[65625,"RY","FOR Research","FOR","R",65625,"3823RY",382000,300002]
[65626,"RY","FOR Research","FOR","R",65626,"3823RY",382000,300002]
[65627,"RR","FOR Research","FOR","R",65627,"3823RR",382000,300002]
[65628,"RR","FOR Research","FOR","R",65628,"3823RR",382000,300002]
[65629,"FA","FOR Financial Aid/Schol","FOR","FA",65629,"3823FA",388000,300002]
[{"$f":"IF(F3444>0,VALUE(F3444),\" \")","v":65630},{"$f":"IF(A3444<>\" \",RIGHT(G3444,2),\" \")","v":"RR"},{"$f":"IF(A3444<>\" \",VLOOKUP(H3444,ALLOC_NCHEMS,2,0),\" \")","v":"FOR Research"},{"$f":"IF(A3444<>\" \",VLOOKUP(I3444,ALLOC,2,0),\" \")","v":"FOR"},"R",65630,"3823RR",382000,300002]
[65631,"RR","FOR Research","FOR","R",65631,"3823RR",382000,300002]
[65632,"RR","FOR Research","FOR","R",65632,"3823RR",382000,300002]
[65633,"RD","FOR Research","FOR","R",65633,"3823RD",382000,300002]
[65634,"RR","FOR Research","FOR","R",65634,"3823RR",382000,300002]
[65635,"RR","FOR Research","FOR","R",65635,"3823RR",382000,300002]
[65636,"RR","FOR Research","FOR","R",65636,"3823RR",382000,300002]
[65640,"PS","FOR Public Service","FOR","PS",65640,"3823PS",383000,300002]
[65650,"RR","FOR Research","FOR","R",65650,"3823RR",382000,300002]
[65651,"RR","FOR Research","FOR","R",65651,"3823RR",382000,300002]
[65700,"RR","FOR Research","FOR","R",65700,"3823RR",382000,300002]
[65701,"RT","FOR Research","FOR","R",65701,"3823RT",382000,300002]
[65702,"PS","FOR Public Service","FOR","PS",65702,"3823PS",383000,300002]
[65703,"RR","FOR Research","FOR","R",65703,"3823RR",382000,300002]
[65704,"RR","FOR Research","FOR","R",65704,"3823RR",382000,300002]
[65705,"RR","FOR Research","FOR",{"$f":"IF(A3459<>\" \",VLOOKUP(B3459,NCHEMS_ABBR,3,0),\" \")","v":"R"},65705,"3823RR",382000,300002]
[65706,"RR","FOR Research","FOR","R",65706,"3823RR",382000,300002]
[65707,"RR","FOR Research","FOR","R",65707,"3823RR",382000,300002]
[65708,"RR","FOR Research","FOR","R",65708,"3823RR",382000,300002]
[65709,"RR","FOR Research","FOR","R",65709,"3823RR",382000,300002]
[65710,"RR","FOR Research","FOR","R",65710,"3823RR",382000,300002]
[65711,"RR","FOR Research","FOR","R",65711,"3823RR",382000,300002]
[65712,"RR","FOR Research","FOR","R",65712,"3823RR",382000,300002]
[65713,"PS","FOR Public Service","FOR","PS",65713,"3823PS",383000,300002]
[65714,"RD","FOR Research","FOR","R",65714,"3823RD",382000,300002]
[65715,"RR","FOR Research","FOR","R",65715,"3823RR",382000,300002]
[65716,"RR","FOR Research","FOR","R",65716,"3823RR",382000,300002]
[65717,"PS","FOR Public Service","FOR","PS",65717,"3823PS",383000,300002]
[65718,"RR","FOR Research","FOR","R",65718,"3823RR",382000,300002]
[65719,"RR","FOR Research","FOR","R",65719,"3823RR",382000,300002]
[65720,"RR","FOR Research","FOR","R",65720,"3823RR",382000,300002]
[65721,"RR","FOR Research","FOR","R",65721,"3823RR",382000,300002]
[65722,"RR","FOR Research","FOR","R",65722,"3823RR",382000,300002]
[65723,"RR","FOR Research","FOR","R",65723,"3823RR",382000,300002]
[65724,"FA","FOR Financial Aid/Schol","FOR","FA",65724,"3823FA",388000,300002]
[65725,"FA","FOR Financial Aid/Schol","FOR","FA",65725,"3823FA",388000,300002]
[65726,"RR","FOR Research","FOR","R",65726,"3823RR",382000,300002]
[65727,"RR","FOR Research","FOR","R",65727,"3823RR",382000,300002]
[65728,"RR","FOR Research","FOR","R",65728,"3823RR",382000,300002]
[65729,"RR","FOR Research","FOR","R",65729,"3823RR",382000,300002]
[65730,"RD","FOR Research","FOR","R",65730,"3823RD",382000,300002]
[65731,"RR","FOR Research","FOR","R",65731,"3823RR",382000,300002]
[65732,"RR","FOR Research","FOR","R",65732,"3823RR",382000,300002]
[65733,"RR","FOR Research","FOR","R",65733,"3823RR",382000,300002]
[65734,"RR","FOR Research","FOR","R",65734,"3823RR",382000,300002]
[65735,"RR","FOR Research","FOR","R",65735,"3823RR",382000,300002]
[65736,"RD","FOR Research","FOR","R",65736,"3823RD",382000,300002]
[65737,"RD","FOR Research","FOR","R",65737,"3823RD",382000,300002]
[65738,"RR","FOR Research","FOR","R",65738,"3823RR",382000,300002]
[65739,"RR","FOR Research","FOR","R",65739,"3823RR",382000,300002]
[65740,"RR","FOR Research","FOR","R",65740,"3823RR",382000,300002]
[65741,"RR","FOR Research","FOR","R",65741,"3823RR",382000,300002]
[65742,"RR","FOR Research","FOR","R",65742,"3823RR",382000,300002]
[65743,"RR","FOR Research","FOR","R",65743,"3823RR",382000,300002]
[65744,"RR","FOR Research","FOR","R",65744,"3823RR",382000,300002]
[65745,"RR","FOR Research","FOR","R",65745,"3823RR",382000,300002]
[65746,"RR","FOR Research","FOR","R",65746,"3823RR",382000,300002]
[65747,"RR","FOR Research","FOR","R",65747,"3823RR",382000,300002]
[65748,"RR","FOR Research","FOR","R",65748,"3823RR",382000,300002]
[65749,"RR","FOR Research","FOR","R",65749,"3823RR",382000,300002]
[65750,"IN","FOR Instruction","FOR","I",65750,"3823IN",381000,300002]
[65751,"RR","FOR Research","FOR","R",65751,"3823RR",382000,300002]
[65752,"FA","FOR Financial Aid/Schol","FOR","FA",65752,"3823FA",388000,300002]
[65753,"RR","FOR Research","FOR","R",65753,"3823RR",382000,300002]
[{"$f":"IF(F3508>0,VALUE(F3508),\" \")","v":65754},{"$f":"IF(A3508<>\" \",RIGHT(G3508,2),\" \")","v":"RR"},{"$f":"IF(A3508<>\" \",VLOOKUP(H3508,ALLOC_NCHEMS,2,0),\" \")","v":"FOR Research"},{"$f":"IF(A3508<>\" \",VLOOKUP(I3508,ALLOC,2,0),\" \")","v":"FOR"},"R",65754,"3823RR",382000,300002]
[65755,"PS","FOR Public Service","FOR","PS",65755,"3823PS",383000,300002]
[65756,"FA","FOR Financial Aid/Schol","FOR","FA",65756,"3823FA",388000,300002]
[65757,"RR","FOR Research","FOR","R",65757,"3823RR",382000,300002]
[65758,"RR","FOR Research","FOR","R",65758,"3823RR",382000,300002]
[65759,"PS","FOR Public Service","FOR","PS",65759,"3823PS",383000,300002]
[65760,"RR","FOR Research","FOR","R",65760,"3823RR",382000,300002]
[65761,"RD","FOR Research","FOR","R",65761,"3823RD",382000,300002]
[65762,"OM","FOR Research","FOR","PP",65762,"3823OM",382000,300002]
[65763,"RR","FOR Research","FOR","R",65763,"3823RR",382000,300002]
[65764,"RR","FOR Research","FOR","R",65764,"3823RR",382000,300002]
[65765,"RR","FOR Research","FOR","R",65765,"3823RR",382000,300002]
[65766,"RR","FOR Research","FOR","R",65766,"3823RR",382000,300002]
[65767,"RR","FOR Research","FOR","R",65767,"3823RR",382000,300002]
[65800,"RR","FOR Research","FOR","R",65800,"3823RR",382000,300002]
[65801,"RR","FOR Research","FOR",{"$f":"IF(A3523<>\" \",VLOOKUP(B3523,NCHEMS_ABBR,3,0),\" \")","v":"R"},65801,"3823RR",382000,300002]
[65802,"RR","FOR Research","FOR","R",65802,"3823RR",382000,300002]
[65803,"RR","FOR Research","FOR","R",65803,"3823RR",382000,300002]
[65804,"RR","FOR Research","FOR","R",65804,"3823RR",382000,300002]
[65805,"RD","FOR Research","FOR","R",65805,"3823RD",382000,300002]
[65806,"PS","FOR Public Service","FOR","PS",65806,"3823PS",383000,300002]
[65807,"RR","FOR Research","FOR","R",65807,"3823RR",382000,300002]
[65808,"RR","FOR Research","FOR","R",65808,"3823RR",382000,300002]
[65809,"RR","FOR Research","FOR","R",65809,"3823RR",382000,300002]
[65810,"RR","FOR Research","FOR","R",65810,"3823RR",382000,300002]
[65811,"RR","FOR Research","FOR","R",65811,"3823RR",382000,300002]
[65812,"RR","FOR Research","FOR","R",65812,"3823RR",382000,300002]
[65813,"RR","FOR Research","FOR","R",65813,"3823RR",382000,300002]
[65814,"RR","FOR Research","FOR","R",65814,"3823RR",382000,300002]
[65815,"RR","FOR Research","FOR","R",65815,"3823RR",382000,300002]
[65816,"RR","FOR Research","FOR","R",65816,"3823RR",382000,300002]
[65817,"RR","FOR Research","FOR","R",65817,"3823RR",382000,300002]
[65818,"RR","FOR Research","FOR","R",65818,"3823RR",382000,300002]
[65819,"RR","FOR Research","FOR","R",65819,"3823RR",382000,300002]
[65820,"RR","FOR Research","FOR","R",65820,"3823RR",382000,300002]
[65821,"RR","FOR Research","FOR","R",65821,"3823RR",382000,300002]
[65822,"RR","FOR Research","FOR","R",65822,"3823RR",382000,300002]
[65823,"RR","FOR Research","FOR","R",65823,"3823RR",382000,300002]
[65824,"RR","FOR Research","FOR","R",65824,"3823RR",382000,300002]
[65825,"RR","FOR Research","FOR","R",65825,"3823RR",382000,300002]
[65826,"RR","FOR Research","FOR","R",65826,"3823RR",382000,300002]
[65827,"RR","FOR Research","FOR","R",65827,"3823RR",382000,300002]
[65828,"PZ","FOR Public Service","FOR","PS",65828,"3823PZ",383000,300002]
[65829,"RR","FOR Research","FOR","R",65829,"3823RR",382000,300002]
[65830,"RR","FOR Research","FOR","R",65830,"3823RR",382000,300002]
[65831,"RR","FOR Research","FOR","R",65831,"3823RR",382000,300002]
[65832,"RR","FOR Research","FOR","R",65832,"3823RR",382000,300002]
[65833,"RR","FOR Research","FOR","R",65833,"3823RR",382000,300002]
[65834,"RR","FOR Research","FOR","R",65834,"3823RR",382000,300002]
[65835,"RR","FOR Research","FOR","R",65835,"3823RR",382000,300002]
[65836,"RR","FOR Research","FOR","R",65836,"3823RR",382000,300002]
[65837,"RR","FOR Research","FOR","R",65837,"3823RR",382000,300002]
[65838,"FA","FOR Financial Aid/Schol","FOR","FA",65838,"3823FA",388000,300002]
[65839,"RT","FOR Research","FOR","R",65839,"3823RT",382000,300002]
[65840,"RR","FOR Research","FOR","R",65840,"3823RR",382000,300002]
[65841,"RM","FOR Research","FOR","R",65841,"3823RM",382000,300002]
[65842,"RR","FOR Research","FOR","R",65842,"3823RR",382000,300002]
[65843,"RR","FOR Research","FOR","R",65843,"3823RR",382000,300002]
[65844,"RR","FOR Research","FOR","R",65844,"3823RR",382000,300002]
[65845,"RR","FOR Research","FOR","R",65845,"3823RR",382000,300002]
[65846,"RR","FOR Research","FOR","R",65846,"3823RR",382000,300002]
[65847,"RR","FOR Research","FOR","R",65847,"3823RR",382000,300002]
[65848,"RR","FOR Research","FOR","R",65848,"3823RR",382000,300002]
[65849,"RR","FOR Research","FOR","R",65849,"3823RR",382000,300002]
[{"$f":"IF(F3572>0,VALUE(F3572),\" \")","v":65850},{"$f":"IF(A3572<>\" \",RIGHT(G3572,2),\" \")","v":"RR"},{"$f":"IF(A3572<>\" \",VLOOKUP(H3572,ALLOC_NCHEMS,2,0),\" \")","v":"FOR Research"},{"$f":"IF(A3572<>\" \",VLOOKUP(I3572,ALLOC,2,0),\" \")","v":"FOR"},"R",65850,"3823RR",382000,300002]
[65851,"RR","FOR Research","FOR","R",65851,"3823RR",382000,300002]
[65852,"RR","FOR Research","FOR","R",65852,"3823RR",382000,300002]
[65853,"RR","FOR Research","FOR","R",65853,"3823RR",382000,300002]
[65854,"RR","FOR Research","FOR","R",65854,"3823RR",382000,300002]
[65855,"RR","FOR Research","FOR","R",65855,"3823RR",382000,300002]
[65856,"RR","FOR Research","FOR","R",65856,"3823RR",382000,300002]
[65857,"RR","FOR Research","FOR","R",65857,"3823RR",382000,300002]
[65858,"RT","FOR Research","FOR","R",65858,"3823RT",382000,300002]
[65859,"RR","FOR Research","FOR","R",65859,"3823RR",382000,300002]
[65860,"RR","FOR Research","FOR","R",65860,"3823RR",382000,300002]
[65861,"RR","FOR Research","FOR","R",65861,"3823RR",382000,300002]
[65862,"RR","FOR Research","FOR","R",65862,"3823RR",382000,300002]
[65863,"RR","FOR Research","FOR","R",65863,"3823RR",382000,300002]
[65864,"RR","FOR Research","FOR","R",65864,"3823RR",382000,300002]
[65865,"RR","FOR Research","FOR",{"$f":"IF(A3587<>\" \",VLOOKUP(B3587,NCHEMS_ABBR,3,0),\" \")","v":"R"},65865,"3823RR",382000,300002]
[65866,"RR","FOR Research","FOR","R",65866,"3823RR",382000,300002]
[65867,"RR","FOR Research","FOR","R",65867,"3823RR",382000,300002]
[65868,"RR","FOR Research","FOR","R",65868,"3823RR",382000,300002]
[65869,"RT","FOR Research","FOR","R",65869,"3823RT",382000,300002]
[65870,"RR","FOR Research","FOR","R",65870,"3823RR",382000,300002]
[65871,"RR","FOR Research","FOR","R",65871,"3823RR",382000,300002]
[65872,"RR","FOR Research","FOR","R",65872,"3823RR",382000,300002]
[65873,"RR","FOR Research","FOR","R",65873,"3823RR",382000,300002]
[65874,"RR","FOR Research","FOR","R",65874,"3823RR",382000,300002]
[65875,"RR","FOR Research","FOR","R",65875,"3823RR",382000,300002]
[65876,"RR","FOR Research","FOR","R",65876,"3823RR",382000,300002]
[65877,"RR","FOR Research","FOR","R",65877,"3823RR",382000,300002]
[65878,"RR","FOR Research","FOR","R",65878,"3823RR",382000,300002]
[65879,"FA","FOR Financial Aid/Schol","FOR","FA",65879,"3823FA",388000,300002]
[65880,"RR","FOR Research","FOR","R",65880,"3823RR",382000,300002]
[65881,"RR","FOR Research","FOR","R",65881,"3823RR",382000,300002]
[65882,"RD","FOR Research","FOR","R",65882,"3823RD",382000,300002]
[65883,"RM","FOR Research","FOR","R",65883,"3823RM",382000,300002]
[65884,"RR","FOR Research","FOR","R",65884,"3823RR",382000,300002]
[65885,"RR","FOR Research","FOR","R",65885,"3823RR",382000,300002]
[65886,"RR","FOR Research","FOR","R",65886,"3823RR",382000,300002]
[65887,"RR","FOR Research","FOR","R",65887,"3823RR",382000,300002]
[65888,"RR","FOR Research","FOR","R",65888,"3823RR",382000,300002]
[65889,"RR","FOR Research","FOR","R",65889,"3823RR",382000,300002]
[65890,"RR","FOR Research","FOR","R",65890,"3823RR",382000,300002]
[65891,"RT","FOR Research","FOR","R",65891,"3823RT",382000,300002]
[65892,"RR","FOR Research","FOR","R",65892,"3823RR",382000,300002]
[65893,"RR","FOR Research","FOR","R",65893,"3823RR",382000,300002]
[65894,"RR","FOR Research","FOR","R",65894,"3823RR",382000,300002]
[65895,"RR","FOR Research","FOR","R",65895,"3823RR",382000,300002]
[65896,"RR","FOR Research","FOR","R",65896,"3823RR",382000,300002]
[65897,"RT","FOR Research","FOR","R",65897,"3823RT",382000,300002]
[65898,"RT","FOR Research","FOR","R",65898,"3823RT",382000,300002]
[65899,"RT","FOR Research","FOR","R",65899,"3823RT",382000,300002]
[65900,"RT","FOR Research","FOR","R",65900,"3823RT",382000,300002]
[65901,"RT","FOR Research","FOR","R",65901,"3823RT",382000,300002]
[65902,"RT","FOR Research","FOR","R",65902,"3823RT",382000,300002]
[65903,"RR","FOR Research","FOR","R",65903,"3823RR",382000,300002]
[65904,"RR","FOR Research","FOR","R",65904,"3823RR",382000,300002]
[65905,"RR","FOR Research","FOR","R",65905,"3823RR",382000,300002]
[65906,"RR","FOR Research","FOR","R",65906,"3823RR",382000,300002]
[65907,"RR","FOR Research","FOR","R",65907,"3823RR",382000,300002]
[65908,"RR","FOR Research","FOR","R",65908,"3823RR",382000,300002]
[65909,"RT","FOR Research","FOR","R",65909,"3823RT",382000,300002]
[65910,"RR","FOR Research","FOR","R",65910,"3823RR",382000,300002]
[65911,"RR","FOR Research","FOR","R",65911,"3823RR",382000,300002]
[65912,"RR","FOR Research","FOR","R",65912,"3823RR",382000,300002]
[65913,"RR","FOR Research","FOR","R",65913,"3823RR",382000,300002]
[{"$f":"IF(F3636>0,VALUE(F3636),\" \")","v":65914},{"$f":"IF(A3636<>\" \",RIGHT(G3636,2),\" \")","v":"RR"},{"$f":"IF(A3636<>\" \",VLOOKUP(H3636,ALLOC_NCHEMS,2,0),\" \")","v":"FOR Research"},{"$f":"IF(A3636<>\" \",VLOOKUP(I3636,ALLOC,2,0),\" \")","v":"FOR"},"R",65914,"3823RR",382000,300002]
[65915,"RR","FOR Research","FOR","R",65915,"3823RR",382000,300002]
[65916,"RR","FOR Research","FOR","R",65916,"3823RR",382000,300002]
[65917,"RR","FOR Research","FOR","R",65917,"3823RR",382000,300002]
[65918,"RR","FOR Research","FOR","R",65918,"3823RR",382000,300002]
[65919,"RR","FOR Research","FOR","R",65919,"3823RR",382000,300002]
[66000,"RR","FOR Research","FOR","R",66000,"3828RR",382000,300002]
[66001,"RR","FOR Research","FOR","R",66001,"3828RR",382000,300002]
[66002,"RR","FOR Research","FOR","R",66002,"3828RR",382000,300002]
[66003,"RR","FOR Research","FOR","R",66003,"3828RR",382000,300002]
[66004,"RR","FOR Research","FOR","R",66004,"3828RR",382000,300002]
[66005,"RR","FOR Research","FOR","R",66005,"3828RR",382000,300002]
[66006,"RR","FOR Research","FOR","R",66006,"3828RR",382000,300002]
[66007,"RR","FOR Research","FOR","R",66007,"3828RR",382000,300002]
[66008,"RR","FOR Research","FOR","R",66008,"3828RR",382000,300002]
[66009,"RR","FOR Research","FOR",{"$f":"IF(A3651<>\" \",VLOOKUP(B3651,NCHEMS_ABBR,3,0),\" \")","v":"R"},66009,"3828RR",382000,300002]
[66010,"RR","FOR Research","FOR","R",66010,"3828RR",382000,300002]
[66011,"RR","FOR Research","FOR","R",66011,"3828RR",382000,300002]
[66012,"RR","FOR Research","FOR","R",66012,"3828RR",382000,300002]
[66013,"RR","FOR Research","FOR","R",66013,"3828RR",382000,300002]
[66014,"RR","FOR Research","FOR","R",66014,"3828RR",382000,300002]
[66015,"RR","FOR Research","FOR","R",66015,"3828RR",382000,300002]
[66016,"RR","FOR Research","FOR","R",66016,"3828RR",382000,300002]
[66017,"RR","FOR Research","FOR","R",66017,"3828RR",382000,300002]
[66018,"RR","FOR Research","FOR","R",66018,"3828RR",382000,300002]
[66019,"RR","FOR Research","FOR","R",66019,"3828RR",382000,300002]
[66020,"RR","FOR Research","FOR","R",66020,"3828RR",382000,300002]
[66021,"RR","FOR Research","FOR","R",66021,"3828RR",382000,300002]
[66022,"RR","FOR Research","FOR","R",66022,"3828RR",382000,300002]
[66023,"RR","FOR Research","FOR","R",66023,"3828RR",382000,300002]
[66024,"RR","FOR Research","FOR","R",66024,"3828RR",382000,300002]
[66025,"RR","FOR Research","FOR","R",66025,"3828RR",382000,300002]
[66026,"RR","FOR Research","FOR","R",66026,"3828RR",382000,300002]
[66027,"RR","FOR Research","FOR","R",66027,"3828RR",382000,300002]
[66028,"RR","FOR Research","FOR","R",66028,"3828RR",382000,300002]
[66029,"RR","FOR Research","FOR","R",66029,"3828RR",382000,300002]
[66030,"RR","FOR Research","FOR","R",66030,"3828RR",382000,300002]
[66031,"RR","FOR Research","FOR","R",66031,"3828RR",382000,300002]
[66032,"RR","FOR Research","FOR","R",66032,"3828RR",382000,300002]
[66033,"RR","FOR Research","FOR","R",66033,"3828RR",382000,300002]
[66034,"RR","FOR Research","FOR","R",66034,"3828RR",382000,300002]
[66100,"RD","FOR Research","FOR","R",66100,"2320RD",382000,300002]
[66101,"RR","FOR Research","FOR","R",66101,"2320RR",382000,300002]
[66102,"RR","FOR Research","FOR","R",66102,"2320RR",382000,300002]
[66103,"RR","FOR Research","FOR","R",66103,"2320RR",382000,300002]
[66104,"RR","FOR Research","FOR","R",66104,"2320RR",382000,300002]
[66105,"RR","FOR Research","FOR","R",66105,"2320RR",382000,300002]
[66106,"RR","FOR Research","FOR","R",66106,"2320RR",382000,300002]
[66107,"RR","FOR Research","FOR","R",66107,"2320RR",382000,300002]
[66108,"RR","FOR Research","FOR","R",66108,"2320RR",382000,300002]
[66109,"RM","FOR Research","FOR","R",66109,"2320RM",382000,300002]
[66110,"RM","FOR Research","FOR","R",66110,"2320RM",382000,300002]
[66111,"RR","FOR Research","FOR","R",66111,"2320RR",382000,300002]
[66112,"RR","FOR Research","FOR","R",66112,"2320RR",382000,300002]
[66113,"RR","FOR Research","FOR","R",66113,"2320RR",382000,300002]
[66114,"RR","FOR Research","FOR","R",66114,"2320RR",382000,300002]
[66115,"RR","FOR Research","FOR","R",66115,"2320RR",382000,300002]
[66116,"RR","FOR Research","FOR","R",66116,"2320RR",382000,300002]
[66117,"RR","FOR Research","FOR","R",66117,"2320RR",382000,300002]
[66118,"RR","FOR Research","FOR","R",66118,"2320RR",382000,300002]
[66119,"RR","FOR Research","FOR","R",66119,"2320RR",382000,300002]
[66120,"RR","FOR Research","FOR","R",66120,"2320RR",382000,300002]
[66121,"RR","FOR Research","FOR","R",66121,"2320RR",382000,300002]
[66122,"RR","FOR Research","FOR","R",66122,"2320RR",382000,300002]
[{"$f":"IF(F3700>0,VALUE(F3700),\" \")","v":66123},{"$f":"IF(A3700<>\" \",RIGHT(G3700,2),\" \")","v":"RR"},{"$f":"IF(A3700<>\" \",VLOOKUP(H3700,ALLOC_NCHEMS,2,0),\" \")","v":"FOR Research"},{"$f":"IF(A3700<>\" \",VLOOKUP(I3700,ALLOC,2,0),\" \")","v":"FOR"},"R",66123,"2320RR",382000,300002]
[66124,"RR","FOR Research","FOR","R",66124,"2320RR",382000,300002]
[66125,"RR","FOR Research","FOR","R",66125,"2320RR",382000,300002]
[66126,"RR","FOR Research","FOR","R",66126,"2320RR",382000,300002]
[66127,"RR","FOR Research","FOR","R",66127,"2320RR",382000,300002]
[66128,"RR","FOR Research","FOR","R",66128,"2320RR",382000,300002]
[66129,"RR","FOR Research","FOR","R",66129,"2320RR",382000,300002]
[66130,"RR","FOR Research","FOR","R",66130,"2320RR",382000,300002]
[66131,"RR","FOR Research","FOR","R",66131,"2320RR",382000,300002]
[66132,"RR","FOR Research","FOR","R",66132,"2320RR",382000,300002]
[66133,"RR","FOR Research","FOR","R",66133,"2320RR",382000,300002]
[66134,"RR","FOR Research","FOR","R",66134,"2320RR",382000,300002]
[66135,"RR","FOR Research","FOR","R",66135,"2320RR",382000,300002]
[66136,"FA","FOR Financial Aid/Schol","FOR","FA",66136,"2320FA",388000,300002]
[66137,"RR","FOR Research","FOR","R",66137,"2320RR",382000,300002]
[66138,"RR","FOR Research","FOR",{"$f":"IF(A3715<>\" \",VLOOKUP(B3715,NCHEMS_ABBR,3,0),\" \")","v":"R"},66138,"2320RR",382000,300002]
[66139,"RR","FOR Research","FOR","R",66139,"2320RR",382000,300002]
[66140,"RR","FOR Research","FOR","R",66140,"2320RR",382000,300002]
[66141,"RR","FOR Research","FOR","R",66141,"2320RR",382000,300002]
[66142,"RR","FOR Research","FOR","R",66142,"2320RR",382000,300002]
[66143,"RR","FOR Research","FOR","R",66143,"2320RR",382000,300002]
[66144,"RR","FOR Research","FOR","R",66144,"2320RR",382000,300002]
[66145,"RR","FOR Research","FOR","R",66145,"2320RR",382000,300002]
[66146,"PS","FOR Public Service","FOR","PS",66146,"3831PS",383000,300002]
[66147,"RR","FOR Research","FOR","R",66147,"2320RR",382000,300002]
[66500,"RD","FOR Research","FOR","R",66500,"3820RD",382000,300002]
[66501,"RD","FOR Research","FOR","R",66501,"3820RD",382000,300002]
[66502,"PS","FOR Public Service","FOR","PS",66502,"3820PS",383000,300002]
[66503,"RR","FOR Research","FOR","R",66503,"3820RR",382000,300002]
[66504,"RR","FOR Research","FOR","R",66504,"3820RR",382000,300002]
[66505,"RR","FOR Research","FOR","R",66505,"3820RR",382000,300002]
[66506,"RR","FOR Research","FOR","R",66506,"3820RR",382000,300002]
[66507,"RD","FOR Research","FOR","R",66507,"3820RD",382000,300002]
[66508,"RR","FOR Research","FOR","R",66508,"3820RR",382000,300002]
[66509,"RR","FOR Research","FOR","R",66509,"3825RR",382000,300002]
[66510,"PS","FOR Public Service","FOR","PS",66510,"3820PS",383000,300002]
[66511,"PS","FOR Public Service","FOR","PS",66511,"3820PS",383000,300002]
[66512,"PZ","FOR Public Service","FOR","PS",66512,"3820PZ",383000,300002]
[66513,"PS","FOR Public Service","FOR","PS",66513,"3820PS",383000,300002]
[66514,"RD","FOR Research","FOR","R",66514,"3820RD",382000,300002]
[66515,"PS","FOR Public Service","FOR","PS",66515,"3820PS",383000,300002]
[66516,"RY","FOR Research","FOR","R",66516,"3820RY",382000,300002]
[66517,"PS","FOR Public Service","FOR","PS",66517,"3820PS",383000,300002]
[66518,"PS","FOR Public Service","FOR","PS",66518,"3820PS",383000,300002]
[66519,"PS","FOR Public Service","FOR","PS",66519,"3820PS",383000,300002]
[66520,"PS","FOR Public Service","FOR","PS",66520,"3820PS",383000,300002]
[66521,"RD","FOR Research","FOR","R",66521,"3820RD",382000,300002]
[66522,"PS","FOR Public Service","FOR","PS",66522,"3820PS",383000,300002]
[66523,"PS","FOR Public Service","FOR","PS",66523,"3820PS",383000,300002]
[66524,"PY","FOR Public Service","FOR","PS",66524,"3820PY",383000,300002]
[66525,"IN","FOR Instruction","FOR","I",66525,"3820IN",381000,300002]
[66526,"PS","FOR Public Service","FOR","PS",66526,"3820PS",383000,300002]
[66527,"PS","FOR Public Service","FOR","PS",66527,"3820PS",383000,300002]
[66528,"PS","FOR Public Service","FOR","PS",66528,"3820PS",383000,300002]
[66529,"PS","FOR Public Service","FOR","PS",66529,"3820PS",383000,300002]
[66530,"PS","FOR Public Service","FOR","PS",66530,"3820PS",383000,300002]
[66531,"RD","FOR Research","FOR","R",66531,"3820RD",382000,300002]
[66532,"RD","FOR Research","FOR","R",66532,"3820RD",382000,300002]
[66533,"RO","FOR Research","FOR","R",66533,"3820RO",382000,300002]
[66534,"RD","FOR Research","FOR","R",66534,"3820RD",382000,300002]
[66535,"RO","FOR Research","FOR","R",66535,"3820RO",382000,300002]
[66536,"RD","FOR Research","FOR","R",66536,"3820RD",382000,300002]
[66550,"RM","FOR Research","FOR","R",66550,"3820RM",382000,300002]
[66551,"RD","FOR Research","FOR","R",66551,"3820RD",382000,300002]
[{"$f":"IF(F3764>0,VALUE(F3764),\" \")","v":66552},{"$f":"IF(A3764<>\" \",RIGHT(G3764,2),\" \")","v":"RM"},{"$f":"IF(A3764<>\" \",VLOOKUP(H3764,ALLOC_NCHEMS,2,0),\" \")","v":"FOR Research"},{"$f":"IF(A3764<>\" \",VLOOKUP(I3764,ALLOC,2,0),\" \")","v":"FOR"},"R",66552,"3820RM",382000,300002]
[66553,"RY","FOR Research","FOR","R",66553,"3820RY",382000,300002]
[66554,"RM","FOR Research","FOR","R",66554,"3820RM",382000,300002]
[66555,"RD","FOR Research","FOR","R",66555,"3820RD",382000,300002]
[66556,"RM","FOR Research","FOR","R",66556,"3820RM",382000,300002]
[66557,"RM","FOR Research","FOR","R",66557,"3820RM",382000,300002]
[66558,"RM","FOR Research","FOR","R",66558,"3820RM",382000,300002]
[66559,"RM","FOR Research","FOR","R",66559,"3820RM",382000,300002]
[66560,"RM","FOR Research","FOR","R",66560,"3820RM",382000,300002]
[66561,"RM","FOR Research","FOR","R",66561,"3820RM",382000,300002]
[66562,"RM","FOR Research","FOR","R",66562,"3820RM",382000,300002]
[66563,"RM","FOR Research","FOR","R",66563,"3820RM",382000,300002]
[66564,"RD","FOR Research","FOR","R",66564,"3820RD",382000,300002]
[66565,"RD","FOR Research","FOR","R",66565,"3820RD",382000,300002]
[66566,"RD","FOR Research","FOR","R",66566,"3820RD",382000,300002]
[66567,"RD","FOR Research","FOR",{"$f":"IF(A3779<>\" \",VLOOKUP(B3779,NCHEMS_ABBR,3,0),\" \")","v":"R"},66567,"3820RD",382000,300002]
[66568,"RD","FOR Research","FOR","R",66568,"3820RD",382000,300002]
[66569,"RD","FOR Research","FOR","R",66569,"3820RD",382000,300002]
[66570,"RD","FOR Research","FOR","R",66570,"3820RD",382000,300002]
[66571,"RD","FOR Research","FOR","R",66571,"3820RD",382000,300002]
[66572,"RY","FOR Research","FOR","R",66572,"3820RY",382000,300002]
[66573,"RD","FOR Research","FOR","R",66573,"3820RD",382000,300002]
[66574,"RD","FOR Research","FOR","R",66574,"3820RD",382000,300002]
[66575,"RY","FOR Research","FOR","R",66575,"3820RY",382000,300002]
[66601,"RD","FOR Research","FOR","R",66601,"3820RD",382000,300002]
[66602,"RD","FOR Research","FOR","R",66602,"3820RD",382000,300002]
[66603,"RD","FOR Research","FOR","R",66603,"3820RD",382000,300002]
[66604,"RD","FOR Research","FOR","R",66604,"3820RD",382000,300002]
[66605,"RD","FOR Research","FOR","R",66605,"3820RD",382000,300002]
[66606,"RD","FOR Research","FOR","R",66606,"3820RD",382000,300002]
[66607,"RD","FOR Research","FOR","R",66607,"3820RD",382000,300002]
[66608,"RZ","FOR Research","FOR","R",66608,"3820RZ",382000,300002]
[66609,"RD","FOR Research","FOR","R",66609,"3820RD",382000,300002]
[66610,"RD","FOR Research","FOR","R",66610,"3820RD",382000,300002]
[66611,"RY","FOR Research","FOR","R",66611,"3820RY",382000,300002]
[66612,"RD","FOR Research","FOR","R",66612,"3820RD",382000,300002]
[66613,"RD","FOR Research","FOR","R",66613,"3820RD",382000,300002]
[66614,"RD","FOR Research","FOR","R",66614,"3820RD",382000,300002]
[66615,"RD","FOR Research","FOR","R",66615,"3820RD",382000,300002]
[66616,"RD","FOR Research","FOR","R",66616,"3820RD",382000,300002]
[66617,"RD","FOR Research","FOR","R",66617,"3820RD",382000,300002]
[66618,"RM","FOR Research","FOR","R",66618,"3820RM",382000,300002]
[66619,"RM","FOR Research","FOR","R",66619,"3820RM",382000,300002]
[66620,"RD","FOR Research","FOR","R",66620,"3820RD",382000,300002]
[66621,"RD","FOR Research","FOR","R",66621,"3820RD",382000,300002]
[66622,"RD","FOR Research","FOR","R",66622,"3820RD",382000,300002]
[66650,"RY","FOR Research","FOR","R",66650,"3820RY",382000,300002]
[66651,"RY","FOR Research","FOR","R",66651,"3820RY",382000,300002]
[66652,"RY","FOR Research","FOR","R",66652,"3820RY",382000,300002]
[66653,"RY","FOR Research","FOR","R",66653,"3820RY",382000,300002]
[66654,"RY","FOR Research","FOR","R",66654,"3820RY",382000,300002]
[66655,"RY","FOR Research","FOR","R",66655,"3820RY",382000,300002]
[66656,"RY","FOR Research","FOR","R",66656,"3820RY",382000,300002]
[66657,"RY","FOR Research","FOR","R",66657,"3820RY",382000,300002]
[66658,"RY","FOR Research","FOR","R",66658,"3820RY",382000,300002]
[66659,"RY","FOR Research","FOR","R",66659,"3820RY",382000,300002]
[66660,"RY","FOR Research","FOR","R",66660,"3820RY",382000,300002]
[66661,"RY","FOR Research","FOR","R",66661,"3820RY",382000,300002]
[66662,"RY","FOR Research","FOR","R",66662,"3820RY",382000,300002]
[66663,"RY","FOR Research","FOR","R",66663,"3820RY",382000,300002]
[66664,"RY","FOR Research","FOR","R",66664,"3820RY",382000,300002]
[66665,"RY","FOR Research","FOR","R",66665,"3820RY",382000,300002]
[66666,"RY","FOR Research","FOR","R",66666,"3820RY",382000,300002]
[66667,"RY","FOR Research","FOR","R",66667,"3820RY",382000,300002]
[{"$f":"IF(F3828>0,VALUE(F3828),\" \")","v":66668},{"$f":"IF(A3828<>\" \",RIGHT(G3828,2),\" \")","v":"RY"},{"$f":"IF(A3828<>\" \",VLOOKUP(H3828,ALLOC_NCHEMS,2,0),\" \")","v":"FOR Research"},{"$f":"IF(A3828<>\" \",VLOOKUP(I3828,ALLOC,2,0),\" \")","v":"FOR"},"R",66668,"3820RY",382000,300002]
[66669,"RY","FOR Research","FOR","R",66669,"3820RY",382000,300002]
[66670,"RY","FOR Research","FOR","R",66670,"3820RY",382000,300002]
[66675,"RD","FOR Research","FOR","R",66675,"3820RD",382000,300002]
[66676,"RD","FOR Research","FOR","R",66676,"3820RD",382000,300002]
[66677,"RD","FOR Research","FOR","R",66677,"3820RD",382000,300002]
[66678,"RD","FOR Research","FOR","R",66678,"3820RD",382000,300002]
[66679,"RD","FOR Research","FOR","R",66679,"3820RD",382000,300002]
[66699,"RR","FOR Research","FOR","R",66699,"3820RR",382000,300002]
[66700,"RR","FOR Research","FOR","R",66700,"3820RR",382000,300002]
[66701,"RR","FOR Research","FOR","R",66701,"3820RR",382000,300002]
[66702,"RR","FOR Research","FOR","R",66702,"3820RR",382000,300002]
[66703,"RR","FOR Research","FOR","R",66703,"3820RR",382000,300002]
[66704,"RR","FOR Research","FOR","R",66704,"3820RR",382000,300002]
[66705,"RR","FOR Research","FOR","R",66705,"3820RR",382000,300002]
[66706,"RR","FOR Research","FOR",{"$f":"IF(A3843<>\" \",VLOOKUP(B3843,NCHEMS_ABBR,3,0),\" \")","v":"R"},66706,"3820RR",382000,300002]
[66707,"RR","FOR Research","FOR","R",66707,"3820RR",382000,300002]
[66708,"RR","FOR Research","FOR","R",66708,"3820RR",382000,300002]
[66709,"RD","FOR Research","FOR","R",66709,"3820RD",382000,300002]
[66710,"RR","FOR Research","FOR","R",66710,"3820RR",382000,300002]
[66711,"RR","FOR Research","FOR","R",66711,"3820RR",382000,300002]
[66712,"RR","FOR Research","FOR","R",66712,"3820RR",382000,300002]
[66713,"RR","FOR Research","FOR","R",66713,"3820RR",382000,300002]
[66714,"RR","FOR Research","FOR","R",66714,"3820RR",382000,300002]
[66715,"RR","FOR Research","FOR","R",66715,"3820RR",382000,300002]
[66716,"PS","FOR Public Service","FOR","PS",66716,"3820PS",383000,300002]
[66717,"RR","FOR Research","FOR","R",66717,"3820RR",382000,300002]
[66718,"RR","FOR Research","FOR","R",66718,"3820RR",382000,300002]
[66719,"RR","FOR Research","FOR","R",66719,"3820RR",382000,300002]
[66720,"RR","FOR Research","FOR","R",66720,"3820RR",382000,300002]
[66721,"FA","FOR Financial Aid/Schol","FOR","FA",66721,"3820FA",388000,300002]
[66722,"RR","FOR Research","FOR","R",66722,"3820RR",382000,300002]
[66723,"RT","FOR Research","FOR","R",66723,"3820RT",382000,300002]
[66724,"RR","FOR Research","FOR","R",66724,"3820RR",382000,300002]
[66725,"RR","FOR Research","FOR","R",66725,"3820RR",382000,300002]
[66726,"RT","FOR Research","FOR","R",66726,"3820RT",382000,300002]
[66727,"RR","FOR Research","FOR","R",66727,"3820RR",382000,300002]
[66728,"RR","FOR Research","FOR","R",66728,"3820RR",382000,300002]
[66729,"RM","FOR Research","FOR","R",66729,"3820RM",382000,300002]
[66730,"RR","FOR Research","FOR","R",66730,"3820RR",382000,300002]
[66731,"RR","FOR Research","FOR","R",66731,"3820RR",382000,300002]
[66732,"RR","FOR Research","FOR","R",66732,"3820RR",382000,300002]
[66733,"RR","FOR Research","FOR","R",66733,"3820RR",382000,300002]
[66734,"RR","FOR Research","FOR","R",66734,"3820RR",382000,300002]
[66735,"RR","FOR Research","FOR","R",66735,"3820RR",382000,300002]
[66736,"RR","FOR Research","FOR","R",66736,"3820RR",382000,300002]
[66737,"RR","FOR Research","FOR","R",66737,"3820RR",382000,300002]
[66738,"RR","FOR Research","FOR","R",66738,"3820RR",382000,300002]
[66739,"RR","FOR Research","FOR","R",66739,"3820RR",382000,300002]
[66740,"RR","FOR Research","FOR","R",66740,"3820RR",382000,300002]
[66741,"RR","FOR Research","FOR","R",66741,"3820RR",382000,300002]
[66742,"RR","FOR Research","FOR","R",66742,"3820RR",382000,300002]
[66743,"RR","FOR Research","FOR","R",66743,"3820RR",382000,300002]
[66744,"RR","FOR Research","FOR","R",66744,"3820RR",382000,300002]
[66745,"RR","FOR Research","FOR","R",66745,"3820RR",382000,300002]
[66746,"RR","FOR Research","FOR","R",66746,"3820RR",382000,300002]
[66747,"RR","FOR Research","FOR","R",66747,"3820RR",382000,300002]
[66748,"RR","FOR Research","FOR","R",66748,"3820RR",382000,300002]
[66749,"RR","FOR Research","FOR","R",66749,"3820RR",382000,300002]
[66750,"RR","FOR Research","FOR","R",66750,"3820RR",382000,300002]
[66751,"RR","FOR Research","FOR","R",66751,"3820RR",382000,300002]
[66752,"RR","FOR Research","FOR","R",66752,"3820RR",382000,300002]
[66753,"RR","FOR Research","FOR","R",66753,"3820RR",382000,300002]
[66754,"RR","FOR Research","FOR","R",66754,"3820RR",382000,300002]
[{"$f":"IF(F3892>0,VALUE(F3892),\" \")","v":66755},{"$f":"IF(A3892<>\" \",RIGHT(G3892,2),\" \")","v":"RR"},{"$f":"IF(A3892<>\" \",VLOOKUP(H3892,ALLOC_NCHEMS,2,0),\" \")","v":"FOR Research"},{"$f":"IF(A3892<>\" \",VLOOKUP(I3892,ALLOC,2,0),\" \")","v":"FOR"},"R",66755,"3820RR",382000,300002]
[66756,"RR","FOR Research","FOR","R",66756,"3820RR",382000,300002]
[66757,"RR","FOR Research","FOR","R",66757,"3820RR",382000,300002]
[66758,"RR","FOR Research","FOR","R",66758,"3820RR",382000,300002]
[66759,"RR","FOR Research","FOR","R",66759,"3820RR",382000,300002]
[66760,"RR","FOR Research","FOR","R",66760,"3820RR",382000,300002]
[66761,"RR","FOR Research","FOR","R",66761,"3820RR",382000,300002]
[66762,"RR","FOR Research","FOR","R",66762,"3820RR",382000,300002]
[66763,"RR","FOR Research","FOR","R",66763,"3820RR",382000,300002]
[66764,"RR","FOR Research","FOR","R",66764,"3820RR",382000,300002]
[66765,"RR","FOR Research","FOR","R",66765,"3820RR",382000,300002]
[66766,"RR","FOR Research","FOR","R",66766,"3820RR",382000,300002]
[66767,"RR","FOR Research","FOR","R",66767,"3820RR",382000,300002]
[66768,"RR","FOR Research","FOR","R",66768,"3820RR",382000,300002]
[66769,"RR","FOR Research","FOR","R",66769,"3820RR",382000,300002]
[66770,"RR","FOR Research","FOR",{"$f":"IF(A3907<>\" \",VLOOKUP(B3907,NCHEMS_ABBR,3,0),\" \")","v":"R"},66770,"3820RR",382000,300002]
[66771,"RR","FOR Research","FOR","R",66771,"3820RR",382000,300002]
[66772,"RR","FOR Research","FOR","R",66772,"3820RR",382000,300002]
[66773,"RR","FOR Research","FOR","R",66773,"3820RR",382000,300002]
[66774,"RR","FOR Research","FOR","R",66774,"3820RR",382000,300002]
[66775,"RR","FOR Research","FOR","R",66775,"3820RR",382000,300002]
[66776,"RR","FOR Research","FOR","R",66776,"3820RR",382000,300002]
[66777,"RR","FOR Research","FOR","R",66777,"3820RR",382000,300002]
[66778,"RR","FOR Research","FOR","R",66778,"3820RR",382000,300002]
[66779,"RR","FOR Research","FOR","R",66779,"3820RR",382000,300002]
[66780,"RR","FOR Research","FOR","R",66780,"3820RR",382000,300002]
[66781,"RR","FOR Research","FOR","R",66781,"3820RR",382000,300002]
[66782,"RR","FOR Research","FOR","R",66782,"3820RR",382000,300002]
[66783,"RR","FOR Research","FOR","R",66783,"3820RR",382000,300002]
[66784,"RR","FOR Research","FOR","R",66784,"3820RR",382000,300002]
[66785,"RR","FOR Research","FOR","R",66785,"3820RR",382000,300002]
[66786,"RR","FOR Research","FOR","R",66786,"3820RR",382000,300002]
[66787,"RR","FOR Research","FOR","R",66787,"3820RR",382000,300002]
[66788,"RR","FOR Research","FOR","R",66788,"3820RR",382000,300002]
[66789,"RR","FOR Research","FOR","R",66789,"3820RR",382000,300002]
[66790,"RR","FOR Research","FOR","R",66790,"3820RR",382000,300002]
[66791,"RR","FOR Research","FOR","R",66791,"3820RR",382000,300002]
[66792,"RR","FOR Research","FOR","R",66792,"3820RR",382000,300002]
[66793,"RR","FOR Research","FOR","R",66793,"3820RR",382000,300002]
[66794,"RR","FOR Research","FOR","R",66794,"3820RR",382000,300002]
[66795,"RR","FOR Research","FOR","R",66795,"3820RR",382000,300002]
[66796,"RR","FOR Research","FOR","R",66796,"3820RR",382000,300002]
[66797,"RR","FOR Research","FOR","R",66797,"3820RR",382000,300002]
[66798,"RR","FOR Research","FOR","R",66798,"3820RR",382000,300002]
[66799,"RR","FOR Research","FOR","R",66799,"3820RR",382000,300002]
[66800,"RR","FOR Research","FOR","R",66800,"3820RR",382000,300002]
[66801,"RR","FOR Research","FOR","R",66801,"3820RR",382000,300002]
[66802,"RR","FOR Research","FOR","R",66802,"3820RR",382000,300002]
[66803,"RR","FOR Research","FOR","R",66803,"3820RR",382000,300002]
[66804,"RR","FOR Research","FOR","R",66804,"3820RR",382000,300002]
[66805,"RR","FOR Research","FOR","R",66805,"3820RR",382000,300002]
[66806,"RR","FOR Research","FOR","R",66806,"3820RR",382000,300002]
[66807,"RR","FOR Research","FOR","R",66807,"3820RR",382000,300002]
[66808,"RR","FOR Research","FOR","R",66808,"3820RR",382000,300002]
[66809,"RR","FOR Research","FOR","R",66809,"3820RR",382000,300002]
[66810,"RR","FOR Research","FOR","R",66810,"3820RR",382000,300002]
[66811,"RR","FOR Research","FOR","R",66811,"3820RR",382000,300002]
[66812,"RR","FOR Research","FOR","R",66812,"3820RR",382000,300002]
[66813,"RR","FOR Research","FOR","R",66813,"3820RR",382000,300002]
[66814,"RR","FOR Research","FOR","R",66814,"3820RR",382000,300002]
[66815,"RR","FOR Research","FOR","R",66815,"3820RR",382000,300002]
[66816,"RR","FOR Research","FOR","R",66816,"3820RR",382000,300002]
[66817,"RR","FOR Research","FOR","R",66817,"3820RR",382000,300002]
[66818,"RR","FOR Research","FOR","R",66818,"3820RR",382000,300002]
[{"$f":"IF(F3956>0,VALUE(F3956),\" \")","v":66819},{"$f":"IF(A3956<>\" \",RIGHT(G3956,2),\" \")","v":"RR"},{"$f":"IF(A3956<>\" \",VLOOKUP(H3956,ALLOC_NCHEMS,2,0),\" \")","v":"FOR Research"},{"$f":"IF(A3956<>\" \",VLOOKUP(I3956,ALLOC,2,0),\" \")","v":"FOR"},"R",66819,"3820RR",382000,300002]
[66820,"RR","FOR Research","FOR","R",66820,"3820RR",382000,300002]
[66821,"RR","FOR Research","FOR","R",66821,"3820RR",382000,300002]
[66822,"RR","FOR Research","FOR","R",66822,"3820RR",382000,300002]
[66823,"RR","FOR Research","FOR","R",66823,"3820RR",382000,300002]
[66824,"RR","FOR Research","FOR","R",66824,"3820RR",382000,300002]
[66825,"RR","FOR Research","FOR","R",66825,"3820RR",382000,300002]
[66826,"RR","FOR Research","FOR","R",66826,"3820RR",382000,300002]
[66827,"RR","FOR Research","FOR","R",66827,"3820RR",382000,300002]
[66828,"RR","FOR Research","FOR","R",66828,"3820RR",382000,300002]
[66829,"RD","FOR Research","FOR","R",66829,"3820RD",382000,300002]
[66830,"RR","FOR Research","FOR","R",66830,"3820RR",382000,300002]
[66831,"RR","FOR Research","FOR","R",66831,"3820RR",382000,300002]
[66832,"RR","FOR Research","FOR","R",66832,"3820RR",382000,300002]
[66833,"RR","FOR Research","FOR","R",66833,"3820RR",382000,300002]
[66834,"RR","FOR Research","FOR",{"$f":"IF(A3971<>\" \",VLOOKUP(B3971,NCHEMS_ABBR,3,0),\" \")","v":"R"},66834,"3820RR",382000,300002]
[66835,"RR","FOR Research","FOR","R",66835,"3820RR",382000,300002]
[66836,"RR","FOR Research","FOR","R",66836,"3820RR",382000,300002]
[66837,"RR","FOR Research","FOR","R",66837,"3820RR",382000,300002]
[66838,"RR","FOR Research","FOR","R",66838,"3820RR",382000,300002]
[66839,"RR","FOR Research","FOR","R",66839,"3820RR",382000,300002]
[66840,"RR","FOR Research","FOR","R",66840,"3820RR",382000,300002]
[66841,"RR","FOR Research","FOR","R",66841,"3820RR",382000,300002]
[66842,"RR","FOR Research","FOR","R",66842,"3820RR",382000,300002]
[66843,"RR","FOR Research","FOR","R",66843,"3820RR",382000,300002]
[66844,"RR","FOR Research","FOR","R",66844,"3820RR",382000,300002]
[66845,"RR","FOR Research","FOR","R",66845,"3820RR",382000,300002]
[66846,"RR","FOR Research","FOR","R",66846,"3820RR",382000,300002]
[66847,"RR","FOR Research","FOR","R",66847,"3820RR",382000,300002]
[66848,"RR","FOR Research","FOR","R",66848,"3820RR",382000,300002]
[66849,"RR","FOR Research","FOR","R",66849,"3820RR",382000,300002]
[66850,"RR","FOR Research","FOR","R",66850,"3820RR",382000,300002]
[66851,"RR","FOR Research","FOR","R",66851,"3820RR",382000,300002]
[66852,"RR","FOR Research","FOR","R",66852,"3820RR",382000,300002]
[66853,"RR","FOR Research","FOR","R",66853,"3820RR",382000,300002]
[66854,"RR","FOR Research","FOR","R",66854,"3820RR",382000,300002]
[66855,"RR","FOR Research","FOR","R",66855,"3820RR",382000,300002]
[66856,"RY","FOR Research","FOR","R",66856,"3820RY",382000,300002]
[66857,"RY","FOR Research","FOR","R",66857,"3820RY",382000,300002]
[66858,"RY","FOR Research","FOR","R",66858,"3820RY",382000,300002]
[66859,"RM","FOR Research","FOR","R",66859,"3820RM",382000,300002]
[66860,"RM","FOR Research","FOR","R",66860,"3820RM",382000,300002]
[66861,"RM","FOR Research","FOR","R",66861,"3820RM",382000,300002]
[66862,"RM","FOR Research","FOR","R",66862,"3820RM",382000,300002]
[66863,"RM","FOR Research","FOR","R",66863,"3820RM",382000,300002]
[66864,"RD","FOR Research","FOR","R",66864,"3820RD",382000,300002]
[66865,"RR","FOR Research","FOR","R",66865,"3820RR",382000,300002]
[66866,"RR","FOR Research","FOR","R",66866,"3820RR",382000,300002]
[66875,"FA","FOR Financial Aid/Schol","FOR","FA",66875,"3820FA",388000,300002]
[66880,"RR","FOR Research","FOR","R",66880,"3820RR",382000,300002]
[66881,"RR","FOR Research","FOR","R",66881,"3820RR",382000,300002]
[66882,"RR","FOR Research","FOR","R",66882,"3820RR",382000,300002]
[66883,"RR","FOR Research","FOR","R",66883,"3820RR",382000,300002]
[66884,"RR","FOR Research","FOR","R",66884,"3820RR",382000,300002]
[66885,"RR","FOR Research","FOR","R",66885,"3820RR",382000,300002]
[66886,"RR","FOR Research","FOR","R",66886,"3820RR",382000,300002]
[66887,"RR","FOR Research","FOR","R",66887,"3820RR",382000,300002]
[66888,"RR","FOR Research","FOR","R",66888,"3820RR",382000,300002]
[66889,"RR","FOR Research","FOR","R",66889,"3820RR",382000,300002]
[66890,"RR","FOR Research","FOR","R",66890,"3820RR",382000,300002]
[66891,"RR","FOR Research","FOR","R",66891,"3820RR",382000,300002]
[66892,"RR","FOR Research","FOR","R",66892,"3820RR",382000,300002]
[66893,"RR","FOR Research","FOR","R",66893,"3820RR",382000,300002]
[66894,"RR","FOR Research","FOR","R",66894,"3820RR",382000,300002]
[{"$f":"IF(F4020>0,VALUE(F4020),\" \")","v":66895},{"$f":"IF(A4020<>\" \",RIGHT(G4020,2),\" \")","v":"RR"},{"$f":"IF(A4020<>\" \",VLOOKUP(H4020,ALLOC_NCHEMS,2,0),\" \")","v":"FOR Research"},{"$f":"IF(A4020<>\" \",VLOOKUP(I4020,ALLOC,2,0),\" \")","v":"FOR"},"R",66895,"3820RR",382000,300002]
[66896,"RR","FOR Research","FOR","R",66896,"3820RR",382000,300002]
[66897,"RR","FOR Research","FOR","R",66897,"3820RR",382000,300002]
[66898,"RR","FOR Research","FOR","R",66898,"3820RR",382000,300002]
[66899,"RR","FOR Research","FOR","R",66899,"3820RR",382000,300002]
[66900,"RR","FOR Research","FOR","R",66900,"382RRR",382000,300002]
[66901,"RM","FOR Research","FOR","R",66901,"382RRM",382000,300002]
[66902,"RD","FOR Research","FOR","R",66902,"382RRD",382000,300002]
[66903,"RT","FOR Research","FOR","R",66903,"382RRT",382000,300002]
[66904,"PS","FOR Public Service","FOR","PS",66904,"382RPS",383000,300002]
[66905,"RR","FOR Research","FOR","R",66905,"382RRR",382000,300002]
[66906,"RR","FOR Research","FOR","R",66906,"382RRR",382000,300002]
[66907,"RR","FOR Research","FOR","R",66907,"382RRR",382000,300002]
[66908,"RR","FOR Research","FOR","R",66908,"382RRR",382000,300002]
[66909,"RR","FOR Research","FOR","R",66909,"382RRR",382000,300002]
[66910,"RR","FOR Research","FOR",{"$f":"IF(A4035<>\" \",VLOOKUP(B4035,NCHEMS_ABBR,3,0),\" \")","v":"R"},66910,"382RRR",382000,300002]
[66911,"RR","FOR Research","FOR","R",66911,"382RRR",382000,300002]
[66912,"RR","FOR Research","FOR","R",66912,"382RRR",382000,300002]
[66913,"RR","FOR Research","FOR","R",66913,"382RRR",382000,300002]
[66914,"RR","FOR Research","FOR","R",66914,"382RRR",382000,300002]
[66915,"RR","FOR Research","FOR","R",66915,"382RRR",382000,300002]
[66916,"RR","FOR Research","FOR","R",66916,"382RRR",382000,300002]
[66917,"RD","FOR Research","FOR","R",66917,"382RRD",382000,300002]
[66918,"PS","FOR Public Service","FOR","PS",66918,"382RPS",383000,300002]
[66919,"RR","FOR Research","FOR","R",66919,"382RRR",382000,300002]
[66920,"RR","FOR Research","FOR","R",66920,"382RRR",382000,300002]
[66921,"RD","FOR Research","FOR","R",66921,"382RRD",382000,300002]
[66922,"RR","FOR Research","FOR","R",66922,"382RRR",382000,300002]
[66923,"RR","FOR Research","FOR","R",66923,"382RRR",382000,300002]
[66924,"RR","FOR Research","FOR","R",66924,"382RRR",382000,300002]
[66925,"PS","FOR Public Service","FOR","PS",66925,"382RPS",383000,300002]
[66926,"PS","FOR Public Service","FOR","PS",66926,"382RPS",383000,300002]
[66927,"RR","FOR Research","FOR","R",66927,"382RRR",382000,300002]
[66928,"RR","FOR Research","FOR","R",66928,"382RRR",382000,300002]
[66929,"RR","FOR Research","FOR","R",66929,"382RRR",382000,300002]
[66930,"RR","FOR Research","FOR","R",66930,"382RRR",382000,300002]
[66931,"RR","FOR Research","FOR","R",66931,"382RRR",382000,300002]
[66932,"FA","FOR Financial Aid/Schol","FOR","FA",66932,"382RFA",388000,300002]
[66940,"RD","FOR Research","FOR","R",66940,"382RRD",382000,300002]
[66941,"RR","FOR Research","FOR","R",66941,"382RRR",382000,300002]
[66942,"PS","FOR Public Service","FOR","PS",66942,"382RPS",383000,300002]
[66943,"RR","FOR Research","FOR","R",66943,"382RRR",382000,300002]
[66950,"RR","FOR Research","FOR","R",66950,"382RRR",382000,300002]
[66951,"RR","FOR Research","FOR","R",66951,"382RRR",382000,300002]
[66952,"RR","FOR Research","FOR","R",66952,"382RRR",382000,300002]
[66953,"RR","FOR Research","FOR","R",66953,"382RRR",382000,300002]
[66954,"RR","FOR Research","FOR","R",66954,"382RRR",382000,300002]
[66955,"RR","FOR Research","FOR","R",66955,"382RRR",382000,300002]
[66956,"PS","FOR Public Service","FOR","PS",66956,"382RPS",383000,300002]
[66957,"RD","FOR Research","FOR","R",66957,"382RRD",382000,300002]
[66958,"RR","FOR Research","FOR","R",66958,"382RRR",382000,300002]
[66959,"RM","FOR Research","FOR","R",66959,"382RRM",382000,300002]
[66960,"RR","FOR Research","FOR","R",66960,"382RRR",382000,300002]
[66961,"RR","FOR Research","FOR","R",66961,"382RRR",382000,300002]
[66962,"PS","FOR Public Service","FOR","PS",66962,"382RPS",383000,300002]
[66993,"RR","FOR Research","FOR","R",66993,"382RRR",382000,300002]
[66994,"PS","FOR Public Service","FOR","PS",66994,"382RPS",383000,300002]
[66995,"RR","FOR Research","FOR","R",66995,"382RRR",382000,300002]
[66996,"RR","FOR Research","FOR","R",66996,"382RRR",382000,300002]
[66997,"PS","FOR Public Service","FOR","PS",66997,"382RPS",383000,300002]
[66998,"RT","FOR Research","FOR","R",66998,"382RRT",382000,300002]
[66999,"RD","FOR Research","FOR","R",66999,"382RRD",382000,300002]
[67000,"IN","FC Instruction","FC","I",67000,"3015IN",301000,300001]
[67001,"IN","FC Instruction","FC","I",67001,"3015IN",301000,300001]
[{"$f":"IF(F4084>0,VALUE(F4084),\" \")","v":67002},{"$f":"IF(A4084<>\" \",RIGHT(G4084,2),\" \")","v":"IN"},{"$f":"IF(A4084<>\" \",VLOOKUP(H4084,ALLOC_NCHEMS,2,0),\" \")","v":"FC Instruction"},{"$f":"IF(A4084<>\" \",VLOOKUP(I4084,ALLOC,2,0),\" \")","v":"FC"},"I",67002,"3015IN",301000,300001]
[67003,"IN","FC Instruction","FC","I",67003,"3015IN",301000,300001]
[67004,"IN","FC Instruction","FC","I",67004,"3015IN",301000,300001]
[67005,"RR","FOR Research","FOR","R",67005,"3826RR",382000,300002]
[67006,"RR","FOR Research","FOR","R",67006,"3826RR",382000,300002]
[67007,"RR","FOR Research","FOR","R",67007,"3826RR",382000,300002]
[67008,"RR","FOR Research","FOR","R",67008,"3826RR",382000,300002]
[67009,"RR","FOR Research","FOR","R",67009,"3826RR",382000,300002]
[67010,"FA","FOR Financial Aid/Schol","FOR","FA",67010,"3826FA",388000,300002]
[67011,"RR","FOR Research","FOR","R",67011,"3826RR",382000,300002]
[67012,"RR","FOR Research","FOR","R",67012,"3826RR",382000,300002]
[67013,"RR","FOR Research","FOR","R",67013,"3826RR",382000,300002]
[67014,"RR","FOR Research","FOR","R",67014,"3826RR",382000,300002]
[67015,"RR","FOR Research","FOR","R",67015,"3826RR",382000,300002]
[67016,"RR","FOR Research","FOR","R",67016,"3826RR",382000,300002]
[67017,"FA","FOR Financial Aid/Schol","FOR",{"$f":"IF(A4099<>\" \",VLOOKUP(B4099,NCHEMS_ABBR,3,0),\" \")","v":"FA"},67017,"3826FA",388000,300002]
[67018,"RR","FOR Research","FOR","R",67018,"3826RR",382000,300002]
[67019,"RR","FOR Research","FOR","R",67019,"3826RR",382000,300002]
[67020,"RR","FOR Research","FOR","R",67020,"3826RR",382000,300002]
[67021,"RR","FOR Research","FOR","R",67021,"3826RR",382000,300002]
[67022,"RR","FOR Research","FOR","R",67022,"3826RR",382000,300002]
[67023,"RR","FOR Research","FOR","R",67023,"3826RR",382000,300002]
[67024,"RR","FOR Research","FOR","R",67024,"382CRR",382000,300002]
[67025,"RR","FOR Research","FOR","R",67025,"382CRR",382000,300002]
[67026,"RD","FOR Research","FOR","R",67026,"382CRD",382000,300002]
[67027,"RR","FOR Research","FOR","R",67027,"382CRR",382000,300002]
[67028,"RD","FOR Research","FOR","R",67028,"3821RD",382000,300002]
[67029,"RR","FOR Research","FOR","R",67029,"382CRR",382000,300002]
[67030,"IN","FC Instruction","FC","I",67030,"3015IN",301000,300001]
[67031,"IN","FC Instruction","FC","I",67031,"3015IN",301000,300001]
[67032,"FA","FC Scholarships","FC","FA",67032,"308BFA",308000,300001]
[67033,"FA","FC Scholarships","FC","FA",67033,"308BFA",308000,300001]
[67034,"IN","FC Instruction","FC","I",67034,"3015IN",301000,300001]
[67035,"IN","FC Instruction","FC","I",67035,"3015IN",301000,300001]
[67036,"IN","FC Instruction","FC","I",67036,"3015IN",301000,300001]
[67037,"ID","FC Instruction","FC","I",67037,"3015ID",301000,300001]
[67038,"IN","FC Instruction","FC","I",67038,"3015IN",301000,300001]
[67039,"IN","FC Instruction","FC","I",67039,"3015IN",301000,300001]
[67040,"IN","FC Instruction","FC","I",67040,"3013IN",301000,300001]
[67041,"RD","FC Research","FC","R",67041,"3046RD",302000,300001]
[67042,"ID","FC Instruction","FC","I",67042,"3015ID",301000,300001]
[67043,"RD","FOR Research","FOR","R",67043,"3826RD",382000,300002]
[67044,"RD","FOR Research","FOR","R",67044,"382CRD",382000,300002]
[67045,"AS","FC Academic Support","FC","AS",67045,"3046AS",304000,300001]
[67046,"RO","FC Research","FC","R",67046,"3046RO",302000,300001]
[67047,"PS","FC Public Service","FC","PS",67047,"3034PS",303000,300001]
[67048,"RR","FOR Research","FOR","R",67048,"3821RR",382000,300002]
[67049,"PS","FC Public Service","FC","PS",67049,"3034PS",303000,300001]
[67050,"RM","FOR Research","FOR","R",67050,"3821RM",382000,300002]
[67051,"RD","FOR Research","FOR","R",67051,"3821RD",382000,300002]
[67052,"RR","FOR Research","FOR","R",67052,"3821RR",382000,300002]
[67053,"RD","FOR Research","FOR","R",67053,"382CRD",382000,300002]
[67054,"IN","FC Instruction","FC","I",67054,"3015IN",301000,300001]
[67055,"RR","FOR Research","FOR","R",67055,"3826RR",382000,300002]
[67056,"RR","FOR Research","FOR","R",67056,"382CRR",382000,300002]
[67057,"RR","FOR Research","FOR","R",67057,"382CRR",382000,300002]
[67058,"RR","FOR Research","FOR","R",67058,"382CRR",382000,300002]
[67059,"RR","FOR Research","FOR","R",67059,"382CRR",382000,300002]
[67060,"RR","FOR Research","FOR","R",67060,"3826RR",382000,300002]
[67061,"PS","FOR Public Service","FOR","PS",67061,"3821PS",383000,300002]
[67062,"RR","FOR Research","FOR","R",67062,"382CRR",382000,300002]
[67063,"RR","FOR Research","FOR","R",67063,"3821RR",382000,300002]
[67064,"RR","FOR Research","FOR","R",67064,"3826RR",382000,300002]
[67065,"RR","FOR Research","FOR","R",67065,"3826RR",382000,300002]
[{"$f":"IF(F4148>0,VALUE(F4148),\" \")","v":67066},{"$f":"IF(A4148<>\" \",RIGHT(G4148,2),\" \")","v":"RR"},{"$f":"IF(A4148<>\" \",VLOOKUP(H4148,ALLOC_NCHEMS,2,0),\" \")","v":"FOR Research"},{"$f":"IF(A4148<>\" \",VLOOKUP(I4148,ALLOC,2,0),\" \")","v":"FOR"},"R",67066,"3826RR",382000,300002]
[67067,"RR","FOR Research","FOR","R",67067,"3826RR",382000,300002]
[67068,"RR","FOR Research","FOR","R",67068,"3826RR",382000,300002]
[67069,"RR","FOR Research","FOR","R",67069,"3821RR",382000,300002]
[67070,"RR","FOR Research","FOR","R",67070,"3826RR",382000,300002]
[67071,"RR","FOR Research","FOR","R",67071,"3826RR",382000,300002]
[67072,"RR","FOR Research","FOR","R",67072,"3821RR",382000,300002]
[67073,"RR","FOR Research","FOR","R",67073,"3826RR",382000,300002]
[67074,"RT","FOR Research","FOR","R",67074,"382CRT",382000,300002]
[67500,"IN","FC Instruction","FC","I",67500,"3014IN",301000,300001]
[67501,"IN","FC Instruction","FC","I",67501,"3014IN",301000,300001]
[67502,"IN","FC Instruction","FC","I",67502,"3014IN",301000,300001]
[67503,"IN","FC Instruction","FC","I",67503,"3014IN",301000,300001]
[67504,"IN","FC Instruction","FC","I",67504,"3014IN",301000,300001]
[67505,"IN","FC Instruction","FC","I",67505,"3014IN",301000,300001]
[67506,"IR","FC Instruction","FC",{"$f":"IF(A4163<>\" \",VLOOKUP(B4163,NCHEMS_ABBR,3,0),\" \")","v":"I"},67506,"3014IR",301000,300001]
[67507,"ID","FC Instruction","FC","I",67507,"3014ID",301000,300001]
[67508,"AS","FC Academic Support","FC","AS",67508,"3045AS",304000,300001]
[67509,"IR","FC Instruction","FC","I",67509,"3014IR",301000,300001]
[67510,"RO","FC Research","FC","R",67510,"3014RO",302000,300001]
[67511,"IN","FC Instruction","FC","I",67511,"3014IN",301000,300001]
[67512,"IN","FC Instruction","FC","I",67512,"3014IN",301000,300001]
[67513,"RO","FC Research","FC","R",67513,"3014RO",302000,300001]
[67514,"RO","FC Research","FC","R",67514,"3014RO",302000,300001]
[67515,"RO","FC Research","FC","R",67515,"3014RO",302000,300001]
[67516,"RO","FC Research","FC","R",67516,"3014RO",302000,300001]
[67517,"FA","FC Scholarships","FC","FA",67517,"3089FA",308000,300001]
[67519,"ID","FC Instruction","FC","I",67519,"3014ID",301000,300001]
[67520,"ID","FC Instruction","FC","I",67520,"3014ID",301000,300001]
[67521,"ID","FC Instruction","FC","I",67521,"3014ID",301000,300001]
[67522,"ID","FC Instruction","FC","I",67522,"3014ID",301000,300001]
[67523,"ID","FC Instruction","FC","I",67523,"3014ID",301000,300001]
[67524,"AS","FC Academic Support","FC","AS",67524,"3045AS",304000,300001]
[67525,"AS","FC Academic Support","FC","AS",67525,"3045AS",304000,300001]
[67527,"ID","FC Instruction","FC","I",67527,"3014ID",301000,300001]
[67528,"IN","FC Instruction","FC","I",67528,"3014IN",301000,300001]
[67530,"IR","FC Instruction","FC","I",67530,"3014IR",301000,300001]
[67531,"IR","FC Instruction","FC","I",67531,"3014IR",301000,300001]
[67532,"IR","FC Instruction","FC","I",67532,"3014IR",301000,300001]
[67534,"AZ","FC Academic Support","FC","AS",67534,"3045AZ",304000,300001]
[67537,"AS","FC Academic Support","FC","AS",67537,"3045AS",304000,300001]
[67538,"IR","FC Instruction","FC","I",67538,"3014IR",301000,300001]
[67540,"IR","FC Instruction","FC","I",67540,"3014IR",301000,300001]
[67550,"RO","FOR Research","FOR","R",67550,"382ARO",382000,300002]
[67551,"RO","FOR Research","FOR","R",67551,"382ARO",382000,300002]
[67552,"RO","FC Research","FC","R",67552,"3014RO",302000,300001]
[67553,"ID","FC Instruction","FC","I",67553,"3014ID",301000,300001]
[67554,"ID","FC Instruction","FC","I",67554,"3014ID",301000,300001]
[67555,"PS","FC Public Service","FC","PS",67555,"3045PS",303000,300001]
[67557,"PS","FC Public Service","FC","PS",67557,"3045PS",303000,300001]
[67558,"PS","FC Public Service","FC","PS",67558,"3045PS",303000,300001]
[67559,"AS","FC Academic Support","FC","AS",67559,"3045AS",304000,300001]
[67560,"RO","FC Research","FC","R",67560,"3014RO",302000,300001]
[67561,"IN","FC Instruction","FC","I",67561,"3014IN",301000,300001]
[67562,"RT","FC Research","FC","R",67562,"3014RT",302000,300001]
[67563,"IN","FC Instruction","FC","I",67563,"3014IN",301000,300001]
[67564,"ID","FC Instruction","FC","I",67564,"3014ID",301000,300001]
[67565,"AS","FC Academic Support","FC","AS",67565,"3045AS",304000,300001]
[67566,"PS","FC Public Service","FC","PS",67566,"3045PS",303000,300001]
[67567,"ID","FC Instruction","FC","I",67567,"3014ID",301000,300001]
[67568,"RT","FC Research","FC","R",67568,"3014RT",302000,300001]
[67569,"IN","FC Instruction","FC","I",67569,"3014IN",301000,300001]
[67570,"ID","FC Instruction","FC","I",67570,"3014ID",301000,300001]
[67571,"IN","FC Instruction","FC","I",67571,"3014IN",301000,300001]
[{"$f":"IF(F4212>0,VALUE(F4212),\" \")","v":67572},{"$f":"IF(A4212<>\" \",RIGHT(G4212,2),\" \")","v":"FA"},{"$f":"IF(A4212<>\" \",VLOOKUP(H4212,ALLOC_NCHEMS,2,0),\" \")","v":"FC Scholarships"},{"$f":"IF(A4212<>\" \",VLOOKUP(I4212,ALLOC,2,0),\" \")","v":"FC"},"FA",67572,"3089FA",308000,300001]
[67573,"PS","FC Public Service","FC","PS",67573,"3045PS",303000,300001]
[67574,"RO","FC Research","FC","R",67574,"3014RO",302000,300001]
[67575,"IN","FC Instruction","FC","I",67575,"3014IN",301000,300001]
[67576,"IN","FC Instruction","FC","I",67576,"3014IN",301000,300001]
[67577,"IN","FC Instruction","FC","I",67577,"3014IN",301000,300001]
[67578,"IN","FC Instruction","FC","I",67578,"3014IN",301000,300001]
[67579,"IN","FC Instruction","FC","I",67579,"3014IN",301000,300001]
[67580,"IN","FC Instruction","FC","I",67580,"3014IN",301000,300001]
[67581,"IN","FC Instruction","FC","I",67581,"3014IN",301000,300001]
[67582,"IN","FC Instruction","FC","I",67582,"3014IN",301000,300001]
[67583,"IN","FC Instruction","FC","I",67583,"3014IN",301000,300001]
[67584,"ID","FC Instruction","FC","I",67584,"3014ID",301000,300001]
[68000,"RR","FOR Research","FOR","R",68000,"3821RR",382000,300002]
[68001,"RR","FOR Research","FOR","R",68001,"3821RR",382000,300002]
[68002,"RR","FOR Research","FOR",{"$f":"IF(A4227<>\" \",VLOOKUP(B4227,NCHEMS_ABBR,3,0),\" \")","v":"R"},68002,"3821RR",382000,300002]
[68003,"RR","FOR Research","FOR","R",68003,"3821RR",382000,300002]
[68004,"RT","FOR Research","FOR","R",68004,"3821RT",382000,300002]
[68005,"RR","FOR Research","FOR","R",68005,"3821RR",382000,300002]
[68006,"RD","FOR Research","FOR","R",68006,"3821RD",382000,300002]
[68007,"RD","FOR Research","FOR","R",68007,"3821RD",382000,300002]
[68008,"RM","FOR Research","FOR","R",68008,"3821RM",382000,300002]
[68009,"RR","FOR Research","FOR","R",68009,"3821RR",382000,300002]
[68010,"RD","FOR Research","FOR","R",68010,"3821RD",382000,300002]
[68011,"RD","FOR Research","FOR","R",68011,"3821RD",382000,300002]
[68012,"RR","FOR Research","FOR","R",68012,"3821RR",382000,300002]
[68013,"RT","FOR Research","FOR","R",68013,"3821RT",382000,300002]
[68014,"RM","FOR Research","FOR","R",68014,"3821RM",382000,300002]
[68015,"RD","FOR Research","FOR","R",68015,"3821RD",382000,300002]
[68016,"RR","FOR Research","FOR","R",68016,"3821RR",382000,300002]
[68017,"RD","FOR Research","FOR","R",68017,"3821RD",382000,300002]
[68018,"RD","FOR Research","FOR","R",68018,"3821RD",382000,300002]
[68019,"PS","FOR Public Service","FOR","PS",68019,"3821PS",383000,300002]
[68020,"FA","FC Scholarships","FC","FA",68020,"308BFA",308000,300001]
[68021,"RR","FOR Research","FOR","R",68021,"3821RR",382000,300002]
[68022,"RR","FOR Research","FOR","R",68022,"3821RR",382000,300002]
[68023,"PS","FOR Public Service","FOR","PS",68023,"3821PS",383000,300002]
[68024,"RR","FOR Research","FOR","R",68024,"3821RR",382000,300002]
[68025,"PS","FOR Public Service","FOR","PS",68025,"3821PS",383000,300002]
[68026,"RM","FOR Research","FOR","R",68026,"3821RM",382000,300002]
[68027,"RD","FOR Research","FOR","R",68027,"3821RD",382000,300002]
[68028,"RR","FOR Research","FOR","R",68028,"3821RR",382000,300002]
[68029,"IN","FOR Research","FOR","I",68029,"3821IN",382000,300002]
[68030,"RR","FOR Research","FOR","R",68030,"3821RR",382000,300002]
[68031,"PS","FOR Public Service","FOR","PS",68031,"3821PS",383000,300002]
[68032,"IN","FC Instruction","FC","I",68032,"3013IN",301000,300001]
[68033,"IN","FC Instruction","FC","I",68033,"3013IN",301000,300001]
[68034,"AS","FC Academic Support","FC","AS",68034,"3044AS",304000,300001]
[68035,"RY","FOR Research","FOR","R",68035,"3821RY",382000,300002]
[68036,"IN","FC Instruction","FC","I",68036,"3013IN",301000,300001]
[68037,"IN","FC Instruction","FC","I",68037,"3013IN",301000,300001]
[68038,"ID","FC Instruction","FC","I",68038,"3013ID",301000,300001]
[68039,"IN","FC Instruction","FC","I",68039,"3013IN",301000,300001]
[68040,"AS","FC Academic Support","FC","AS",68040,"3044AS",304000,300001]
[68041,"ID","FC Instruction","FC","I",68041,"3013ID",301000,300001]
[68042,"IN","FC Instruction","FC","I",68042,"3013IN",301000,300001]
[68043,"IN","FC Instruction","FC","I",68043,"3013IN",301000,300001]
[68044,"AZ","FC Academic Support","FC","AS",68044,"3040AZ",304000,300001]
[68045,"ID","FC Instruction","FC","I",68045,"3013ID",301000,300001]
[68046,"ID","FC Instruction","FC","I",68046,"3013ID",301000,300001]
[68047,"ID","FC Instruction","FC","I",68047,"3013ID",301000,300001]
[68048,"IN","FC Instruction","FC","I",68048,"3013IN",301000,300001]
[68049,"IN","FC Instruction","FC","I",68049,"3013IN",301000,300001]
[68050,"IN","FC Instruction","FC","I",68050,"3013IN",301000,300001]
[{"$f":"IF(F4276>0,VALUE(F4276),\" \")","v":68051},{"$f":"IF(A4276<>\" \",RIGHT(G4276,2),\" \")","v":"PS"},{"$f":"IF(A4276<>\" \",VLOOKUP(H4276,ALLOC_NCHEMS,2,0),\" \")","v":"FOR Public Service"},{"$f":"IF(A4276<>\" \",VLOOKUP(I4276,ALLOC,2,0),\" \")","v":"FOR"},"PS",68051,"3821PS",383000,300002]
[68052,"RY","FOR Research","FOR","R",68052,"3821RY",382000,300002]
[68053,"IN","FC Instruction","FC","I",68053,"3013IN",301000,300001]
[68054,"AS","FC Academic Support","FC","AS",68054,"3044AS",304000,300001]
[68055,"AS","FC Academic Support","FC","AS",68055,"3044AS",304000,300001]
[68056,"IM","FC Instruction","FC","I",68056,"3013IM",301000,300001]
[68057,"FA","FC Scholarships","FC","FA",68057,"308BFA",308000,300001]
[68058,"IN","FC Instruction","FC","I",68058,"3013IN",301000,300001]
[68059,"IN","FC Instruction","FC","I",68059,"3013IN",301000,300001]
[68060,"RR","FOR Research","FOR","R",68060,"3821RR",382000,300002]
[68061,"RR","FOR Research","FOR","R",68061,"3821RR",382000,300002]
[68062,"RR","FOR Research","FOR","R",68062,"3821RR",382000,300002]
[68063,"RR","FOR Research","FOR","R",68063,"3821RR",382000,300002]
[68064,"RR","FOR Research","FOR","R",68064,"3821RR",382000,300002]
[68065,"RR","FOR Research","FOR","R",68065,"3821RR",382000,300002]
[68066,"RR","FOR Research","FOR",{"$f":"IF(A4291<>\" \",VLOOKUP(B4291,NCHEMS_ABBR,3,0),\" \")","v":"R"},68066,"3821RR",382000,300002]
[68067,"RR","FOR Research","FOR","R",68067,"3821RR",382000,300002]
[68068,"RR","FOR Research","FOR","R",68068,"3821RR",382000,300002]
[68069,"RR","FOR Research","FOR","R",68069,"3821RR",382000,300002]
[68070,"RR","FOR Research","FOR","R",68070,"3821RR",382000,300002]
[68071,"RR","FOR Research","FOR","R",68071,"3821RR",382000,300002]
[68072,"RR","FOR Research","FOR","R",68072,"3821RR",382000,300002]
[68073,"RR","FOR Research","FOR","R",68073,"3821RR",382000,300002]
[68074,"RR","FOR Research","FOR","R",68074,"3821RR",382000,300002]
[68075,"RR","FOR Research","FOR","R",68075,"3821RR",382000,300002]
[68076,"RR","FOR Research","FOR","R",68076,"3821RR",382000,300002]
[68077,"RR","FOR Research","FOR","R",68077,"3821RR",382000,300002]
[68078,"RR","FOR Research","FOR","R",68078,"3821RR",382000,300002]
[{"$f":"IF(F4304>0,VALUE(F4304),\" \")","v":68079},{"$f":"IF(A4304<>\" \",RIGHT(G4304,2),\" \")","v":"RR"},{"$f":"IF(A4304<>\" \",VLOOKUP(H4304,ALLOC_NCHEMS,2,0),\" \")","v":"FOR Research"},{"$f":"IF(A4304<>\" \",VLOOKUP(I4304,ALLOC,2,0),\" \")","v":"FOR"},{"$f":"IF(A4304<>\" \",VLOOKUP(B4304,NCHEMS_ABBR,3,0),\" \")","v":"R"},68079,"3821RR",382000,300002]
[68080,"RR","FOR Research","FOR","R",68080,"3821RR",382000,300002]
[{"$f":"IF(F4306>0,VALUE(F4306),\" \")","v":68081},{"$f":"IF(A4306<>\" \",RIGHT(G4306,2),\" \")","v":"RR"},{"$f":"IF(A4306<>\" \",VLOOKUP(H4306,ALLOC_NCHEMS,2,0),\" \")","v":"FOR Research"},{"$f":"IF(A4306<>\" \",VLOOKUP(I4306,ALLOC,2,0),\" \")","v":"FOR"},{"$f":"IF(A4306<>\" \",VLOOKUP(B4306,NCHEMS_ABBR,3,0),\" \")","v":"R"},68081,"3821RR",382000,300002]
[68082,"RR","FOR Research","FOR","R",68082,"3821RR",382000,300002]
[68083,"RR","FOR Research","FOR","R",68083,"3821RR",382000,300002]
[68084,"RR","FOR Research","FOR","R",68084,"3821RR",382000,300002]
[68085,"RR","FOR Research","FOR","R",68085,"3821RR",382000,300002]
[68086,"RR","FOR Research","FOR","R",68086,"3821RR",382000,300002]
[68087,"RR","FOR Research","FOR","R",68087,"3821RR",382000,300002]
[68090,"RR","FOR Research","FOR","R",68090,"3821RR",382000,300002]
[68091,"RR","FOR Research","FOR","R",68091,"3821RR",382000,300002]
[68092,"RR","FOR Research","FOR","R",68092,"3821RR",382000,300002]
[68093,"RR","FOR Research","FOR","R",68093,"3821RR",382000,300002]
[68094,"RR","FOR Research","FOR","R",68094,"3821RR",382000,300002]
[68095,"RR","FOR Research","FOR","R",68095,"3821RR",382000,300002]
[68096,"RR","FOR Research","FOR","R",68096,"3821RR",382000,300002]
[{"$f":"IF(F4320>0,VALUE(F4320),\" \")","v":68097},{"$f":"IF(A4320<>\" \",RIGHT(G4320,2),\" \")","v":"RR"},{"$f":"IF(A4320<>\" \",VLOOKUP(H4320,ALLOC_NCHEMS,2,0),\" \")","v":"FOR Research"},{"$f":"IF(A4320<>\" \",VLOOKUP(I4320,ALLOC,2,0),\" \")","v":"FOR"},"R",68097,"3821RR",382000,300002]
[68098,"RR","FOR Research","FOR","R",68098,"3821RR",382000,300002]
[68099,"RR","FOR Research","FOR","R",68099,"3821RR",382000,300002]
[68100,"RR","FOR Research","FOR","R",68100,"3821RR",382000,300002]
[68101,"RR","FOR Research","FOR","R",68101,"3821RR",382000,300002]
[68102,"RR","FOR Research","FOR","R",68102,"3821RR",382000,300002]
[68103,"RR","FOR Research","FOR","R",68103,"3821RR",382000,300002]
[68104,"RR","FOR Research","FOR","R",68104,"3821RR",382000,300002]
[68105,"RR","FOR Research","FOR","R",68105,"3821RR",382000,300002]
[68106,"RR","FOR Research","FOR","R",68106,"3821RR",382000,300002]
[68107,"RR","FOR Research","FOR","R",68107,"3821RR",382000,300002]
[68108,"RR","FOR Research","FOR","R",68108,"3821RR",382000,300002]
[68109,"RR","FOR Research","FOR","R",68109,"3821RR",382000,300002]
[68110,"RR","FOR Research","FOR","R",68110,"3821RR",382000,300002]
[68111,"RR","FOR Research","FOR","R",68111,"3821RR",382000,300002]
[68112,"RR","FOR Research","FOR","R",68112,"3821RR",382000,300002]
[68113,"RR","FOR Research","FOR","R",68113,"3821RR",382000,300002]
[68114,"RR","FOR Research","FOR","R",68114,"3821RR",382000,300002]
[68115,"RR","FOR Research","FOR","R",68115,"3821RR",382000,300002]
[68116,"RR","FOR Research","FOR","R",68116,"3821RR",382000,300002]
[68117,"RR","FOR Research","FOR","R",68117,"3821RR",382000,300002]
[68118,"RR","FOR Research","FOR","R",68118,"3821RR",382000,300002]
[68119,"RD","FOR Research","FOR","R",68119,"3821RD",382000,300002]
[68120,"PS","FOR Public Service","FOR","PS",68120,"3821PS",383000,300002]
[68121,"RD","FOR Research","FOR","R",68121,"3821RD",382000,300002]
[68122,"RR","FOR Research","FOR","R",68122,"3821RR",382000,300002]
[68123,"RR","FOR Research","FOR","R",68123,"3821RR",382000,300002]
[68124,"RR","FOR Research","FOR","R",68124,"3821RR",382000,300002]
[68125,"RR","FOR Research","FOR","R",68125,"3821RR",382000,300002]
[68126,"RY","FOR Research","FOR","R",68126,"3821RY",382000,300002]
[68127,"RR","FOR Research","FOR","R",68127,"3821RR",382000,300002]
[68128,"RR","FOR Research","FOR","R",68128,"3821RR",382000,300002]
[68129,"RR","FOR Research","FOR","R",68129,"3821RR",382000,300002]
[68130,"PS","FOR Public Service","FOR","PS",68130,"3821PS",383000,300002]
[68131,"RR","FOR Research","FOR","R",68131,"3821RR",382000,300002]
[68132,"RR","FOR Research","FOR",{"$f":"IF(A4355<>\" \",VLOOKUP(B4355,NCHEMS_ABBR,3,0),\" \")","v":"R"},68132,"3821RR",382000,300002]
[68133,"RR","FOR Research","FOR","R",68133,"3821RR",382000,300002]
[68134,"RR","FOR Research","FOR","R",68134,"3821RR",382000,300002]
[68135,"RR","FOR Research","FOR","R",68135,"3821RR",382000,300002]
[68136,"RR","FOR Research","FOR","R",68136,"3821RR",382000,300002]
[68137,"RR","FOR Research","FOR","R",68137,"3821RR",382000,300002]
[68138,"RR","FOR Research","FOR","R",68138,"3821RR",382000,300002]
[68139,"RR","FOR Research","FOR","R",68139,"3821RR",382000,300002]
[68140,"RR","FOR Research","FOR","R",68140,"3821RR",382000,300002]
[68141,"RT","FOR Research","FOR","R",68141,"3821RT",382000,300002]
[68142,"RT","FOR Research","FOR","R",68142,"3821RT",382000,300002]
[68143,"RT","FOR Research","FOR","R",68143,"3821RT",382000,300002]
[68144,"RT","FOR Research","FOR","R",68144,"3821RT",382000,300002]
[68145,"RT","FOR Research","FOR","R",68145,"3821RT",382000,300002]
[68146,"RR","FOR Research","FOR","R",68146,"3821RR",382000,300002]
[68147,"RT","FOR Research","FOR","R",68147,"3821RT",382000,300002]
[68148,"RT","FOR Research","FOR","R",68148,"3821RT",382000,300002]
[68149,"RT","FOR Research","FOR","R",68149,"3821RT",382000,300002]
[68150,"PS","FOR Public Service","FOR","PS",68150,"3821PS",383000,300002]
[68151,"RT","FOR Research","FOR","R",68151,"3821RT",382000,300002]
[68152,"RY","FOR Research","FOR","R",68152,"3821RY",382000,300002]
[68153,"RR","FOR Research","FOR","R",68153,"3821RR",382000,300002]
[68154,"RR","FOR Research","FOR","R",68154,"3821RR",382000,300002]
[68155,"RR","FOR Research","FOR","R",68155,"3821RR",382000,300002]
[68156,"RR","FOR Research","FOR","R",68156,"3821RR",382000,300002]
[68157,"RR","FOR Research","FOR","R",68157,"3821RR",382000,300002]
[68158,"RR","FOR Research","FOR","R",68158,"3821RR",382000,300002]
[68160,"RR","FOR Research","FOR","R",68160,"3821RR",382000,300002]
[68161,"RR","FOR Research","FOR","R",68161,"3821RR",382000,300002]
[{"$f":"IF(F4384>0,VALUE(F4384),\" \")","v":68162},{"$f":"IF(A4384<>\" \",RIGHT(G4384,2),\" \")","v":"RR"},{"$f":"IF(A4384<>\" \",VLOOKUP(H4384,ALLOC_NCHEMS,2,0),\" \")","v":"FOR Research"},{"$f":"IF(A4384<>\" \",VLOOKUP(I4384,ALLOC,2,0),\" \")","v":"FOR"},"R",68162,"3821RR",382000,300002]
[68163,"RR","FOR Research","FOR","R",68163,"3821RR",382000,300002]
[68164,"RR","FOR Research","FOR","R",68164,"3821RR",382000,300002]
[68165,"RR","FOR Research","FOR","R",68165,"3821RR",382000,300002]
[68166,"RR","FOR Research","FOR","R",68166,"3821RR",382000,300002]
[68190,"GA","FOR Institutional Supt","FOR","IS",68190,"3828GA",386000,300002]
[68198,"RR","FOR Research","FOR","R",68198,"3821RR",382000,300002]
[68200,"ID","FC Instruction","FC","I",68200,"3013ID",301000,300001]
[68201,"IN","FC Instruction","FC","I",68201,"3013IN",301000,300001]
[68202,"AS","FC Academic Support","FC","AS",68202,"3044AS",304000,300001]
[68203,"IN","FC Instruction","FC","I",68203,"3013IN",301000,300001]
[68204,"IN","FC Instruction","FC","I",68204,"3013IN",301000,300001]
[68205,"IN","FC Instruction","FC","I",68205,"3013IN",301000,300001]
[68206,"IN","FC Instruction","FC","I",68206,"3013IN",301000,300001]
[68207,"IN","FC Instruction","FC","I",68207,"3013IN",301000,300001]
[68208,"IN","FC Instruction","FC","I",68208,"3013IN",301000,300001]
[68209,"IN","FC Instruction","FC","I",68209,"3013IN",301000,300001]
[" "," "," "," "," ",null,null,null,{"$f":"IF(H4401<>0,VLOOKUP(H4401,ALLOC_NCHEMS,3,0),\" \")","v":" "}]
[" "," "," "," "," ",null,null,null," "]
[" "," "," "," "," ",null,null,null," "]
[" "," "," "," "," ",null,null,null," "]
[" "," "," "," "," ",null,null,null," "]
[" "," "," "," "," ",null,null,null," "]
[" "," "," "," "," ",null,null,null," "]
[" "," "," "," "," ",null,null,null," "]
[" "," "," "," "," ",null,null,null," "]
[" "," "," "," "," ",null,null,null," "]
[" "," "," "," "," ",null,null,null," "]
[" "," "," "," "," ",null,null,null," "]
[" "," "," "," "," ",null,null,null," "]
[" "," "," "," "," ",null,null,null," "]
[" "," "," "," "," ",null,null,null," "]
[" "," "," "," "," ",null,null,null," "]
[" "," "," "," "," ",null,null,null," "]
[" "," "," "," "," ",null,null,null," "]
[" "," "," "," ",{"$f":"IF(A4419<>\" \",VLOOKUP(B4419,NCHEMS_ABBR,3,0),\" \")","v":" "},null,null,null," "]
[" "," "," "," "," ",null,null,null," "]
[" "," "," "," "," ",null,null,null," "]
[" "," "," "," "," ",null,null,null," "]
[" "," "," "," "," ",null,null,null," "]
[" "," "," "," "," ",null,null,null," "]
[" "," "," "," "," ",null,null,null," "]
[" "," "," "," "," ",null,null,null," "]
[" "," "," "," "," ",null,null,null," "]
[" "," "," "," "," ",null,null,null," "]
[" "," "," "," "," ",null,null,null," "]
[" "," "," "," "," ",null,null,null," "]
[" "," "," "," "," ",null,null,null,{"$f":"IF(H4431<>0,VLOOKUP(H4431,ALLOC_NCHEMS,3,0),\" \")","v":" "}]
[" "," "," "," "," ",null,null,null," "]
[" "," "," "," "," ",null,null,null," "]
[" "," "," "," "," ",null,null,null," "]
[" "," "," "," "," ",null,null,null," "]
[" "," "," "," "," ",null,null,null," "]
[" "," "," "," "," ",null,null,null," "]
[" "," "," "," "," ",null,null,null," "]
[" "," "," "," "," ",null,null,null," "]
[" "," "," "," "," ",null,null,null," "]
[" "," "," "," "," ",null,null,null," "]
[" "," "," "," "," ",null,null,null," "]
[" "," "," "," "," ",null,null,null," "]
[" "," "," "," "," ",null,null,null," "]
[" "," "," "," "," ",null,null,null," "]
[" "," "," "," "," ",null,null,null," "]
[" "," "," "," "," ",null,null,null," "]
[{"$f":"IF(F4448>0,VALUE(F4448),\" \")","v":" "},{"$f":"IF(A4448<>\" \",RIGHT(G4448,2),\" \")","v":" "},{"$f":"IF(A4448<>\" \",VLOOKUP(H4448,ALLOC_NCHEMS,2,0),\" \")","v":" "},{"$f":"IF(A4448<>\" \",VLOOKUP(I4448,ALLOC,2,0),\" \")","v":" "}," ",null,null,null," "]
[" "," "," "," "," ",null,null,null," "]
[" "," "," "," "," ",null,null,null," "]
[" "," "," "," "," ",null,null,null," "]
[" "," "," "," "," ",null,null,null," "]
[" "," "," "," "," ",null,null,null," "]
[" "," "," "," "," ",null,null,null," "]
[" "," "," "," "," ",null,null,null," "]
[" "," "," "," "," ",null,null,null," "]
[" "," "," "," "," ",null,null,null," "]
[" "," "," "," "," ",null,null,null," "]
[" "," "," "," "," ",null,null,null," "]
[" "," "," "," "," ",null,null,null," "]
[" "," "," "," "," ",null,null,null," "]
[" "," "," "," "," ",null,null,null," "]
[" "," "," "," "," ",null,null,null," "]
[" "," "," "," "," ",null,null,null," "]
[" "," "," "," "," ",null,null,null," "]
[" "," "," "," "," ",null,null,null," "]
[" "," "," "," "," ",null,null,null," "]
[" "," "," "," "," ",null,null,null," "]
[" "," "," "," "," ",null,null,null," "]
[" "," "," "," "," ",null,null,null," "]
[" "," "," "," "," ",null,null,null," "]
[" "," "," "," "," ",null,null,null," "]
[" "," "," "," "," ",null,null,null," "]
[" "," "," "," "," ",null,null,null," "]
[" "," "," "," "," ",null,null,null," "]
[" "," "," "," "," ",null,null,null," "]
[" "," "," "," "," ",null,null,null," "]
[" "," "," "," "," ",null,null,null," "]
[" "," "," "," "," ",null,null,null," "]
[" "," "," "," "," ",null,null,null," "]
[" "," "," "," "," ",null,null,null," "]
[" "," "," "," "," ",null,null,null," "]
[" "," "," "," ",{"$f":"IF(A4483<>\" \",VLOOKUP(B4483,NCHEMS_ABBR,3,0),\" \")","v":" "},null,null,null," "]
[" "," "," "," "," ",null,null,null," "]
[" "," "," "," "," ",null,null,null," "]
[" "," "," "," "," ",null,null,null," "]
[" "," "," "," "," ",null,null,null," "]
[" "," "," "," "," ",null,null,null," "]
[" "," "," "," "," ",null,null,null," "]
[" "," "," "," "," ",null,null,null," "]
[" "," "," "," "," ",null,null,null," "]
[" "," "," "," "," ",null,null,null," "]
[" "," "," "," "," ",null,null,null," "]
[" "," "," "," "," ",null,null,null," "]
[" "," "," "," "," ",null,null,null,{"$f":"IF(H4495<>0,VLOOKUP(H4495,ALLOC_NCHEMS,3,0),\" \")","v":" "}]
[" "," "," "," "," ",null,null,null," "]
[" "," "," "," "," ",null,null,null," "]
[" "," "," "," "," ",null,null,null," "]
[" "," "," "," "," ",null,null,null," "]
[" "," "," "," "," ",null,null,null," "]
[" "," "," "," "," ",null,null,null," "]
[" "," "," "," "," ",null,null,null," "]
[" "," "," "," "," ",null,null,null," "]
[" "," "," "," "," ",null,null,null," "]
[" "," "," "," "," ",null,null,null," "]
[" "," "," "," "," ",null,null,null," "]
[" "," "," "," "," ",null,null,null," "]
[" "," "," "," "," ",null,null,null," "]
[" "," "," "," "," ",null,null,null," "]
[" "," "," "," "," ",null,null,null," "]
[" "," "," "," "," ",null,null,null," "]
[{"$f":"IF(F4512>0,VALUE(F4512),\" \")","v":" "},{"$f":"IF(A4512<>\" \",RIGHT(G4512,2),\" \")","v":" "},{"$f":"IF(A4512<>\" \",VLOOKUP(H4512,ALLOC_NCHEMS,2,0),\" \")","v":" "},{"$f":"IF(A4512<>\" \",VLOOKUP(I4512,ALLOC,2,0),\" \")","v":" "}," ",null,null,null," "]
[" "," "," "," "," ",null,null,null," "]
[" "," "," "," "," ",null,null,null," "]
[" "," "," "," "," ",null,null,null," "]
[" "," "," "," "," ",null,null,null," "]
[" "," "," "," "," ",null,null,null," "]
[" "," "," "," "," ",null,null,null," "]
[" "," "," "," "," ",null,null,null," "]
[" "," "," "," "," ",null,null,null," "]
[" "," "," "," "," ",null,null,null," "]
[" "," "," "," "," ",null,null,null," "]
[" "," "," "," "," ",null,null,null," "]
[" "," "," "," "," ",null,null,null," "]
[" "," "," "," "," ",null,null,null," "]
[" "," "," "," "," ",null,null,null," "]
[" "," "," "," "," ",null,null,null," "]
[" "," "," "," "," ",null,null,null," "]
[" "," "," "," "," ",null,null,null," "]
[" "," "," "," "," ",null,null,null," "]
[" "," "," "," "," ",null,null,null," "]
[" "," "," "," "," ",null,null,null," "]
[" "," "," "," "," ",null,null,null," "]
[" "," "," "," "," ",null,null,null," "]
[" "," "," "," "," ",null,null,null," "]
[" "," "," "," "," ",null,null,null," "]
[" "," "," "," "," ",null,null,null," "]
[" "," "," "," "," ",null,null,null," "]
[" "," "," "," "," ",null,null,null," "]
[" "," "," "," "," ",null,null,null," "]
[" "," "," "," "," ",null,null,null," "]
[" "," "," "," "," ",null,null,null," "]
[" "," "," "," "," ",null,null,null," "]
[" "," "," "," "," ",null,null,null," "]
[" "," "," "," "," ",null,null,null," "]
[" "," "," "," "," ",null,null,null," "]
[" "," "," "," ",{"$f":"IF(A4547<>\" \",VLOOKUP(B4547,NCHEMS_ABBR,3,0),\" \")","v":" "},null,null,null," "]
[" "," "," "," "," ",null,null,null," "]
[" "," "," "," "," ",null,null,null," "]
[" "," "," "," "," ",null,null,null," "]
[" "," "," "," "," ",null,null,null," "]
[" "," "," "," "," ",null,null,null," "]
[" "," "," "," "," ",null,null,null," "]
[" "," "," "," "," ",null,null,null," "]
[" "," "," "," "," ",null,null,null," "]
[" "," "," "," "," ",null,null,null," "]
[" "," "," "," "," ",null,null,null," "]
[" "," "," "," "," ",null,null,null," "]
[" "," "," "," "," ",null,null,null,{"$f":"IF(H4559<>0,VLOOKUP(H4559,ALLOC_NCHEMS,3,0),\" \")","v":" "}]
[" "," "," "," "," ",null,null,null," "]
[" "," "," "," "," ",null,null,null," "]
[" "," "," "," "," ",null,null,null," "]
[" "," "," "," "," ",null,null,null," "]
[" "," "," "," "," ",null,null,null," "]
[" "," "," "," "," ",null,null,null," "]
[" "," "," "," "," ",null,null,null," "]
[" "," "," "," "," ",null,null,null," "]
[" "," "," "," "," ",null,null,null," "]
[" "," "," "," "," ",null,null,null," "]
[" "," "," "," "," ",null,null,null," "]
[" "," "," "," "," ",null,null,null," "]
[" "," "," "," "," ",null,null,null," "]
[" "," "," "," "," ",null,null,null," "]
[" "," "," "," "," ",null,null,null," "]
[" "," "," "," "," ",null,null,null," "]
[{"$f":"IF(F4576>0,VALUE(F4576),\" \")","v":" "},{"$f":"IF(A4576<>\" \",RIGHT(G4576,2),\" \")","v":" "},{"$f":"IF(A4576<>\" \",VLOOKUP(H4576,ALLOC_NCHEMS,2,0),\" \")","v":" "},{"$f":"IF(A4576<>\" \",VLOOKUP(I4576,ALLOC,2,0),\" \")","v":" "}," ",null,null,null," "]
[" "," "," "," "," ",null,null,null," "]
[" "," "," "," "," ",null,null,null," "]
[" "," "," "," "," ",null,null,null," "]
[" "," "," "," "," ",null,null,null," "]
[" "," "," "," "," ",null,null,null," "]
[" "," "," "," "," ",null,null,null," "]
[" "," "," "," "," ",null,null,null," "]
[" "," "," "," "," ",null,null,null," "]
[" "," "," "," "," ",null,null,null," "]
[" "," "," "," "," ",null,null,null," "]
[" "," "," "," "," ",null,null,null," "]
[" "," "," "," "," ",null,null,null," "]
[" "," "," "," "," ",null,null,null," "]
[" "," "," "," "," ",null,null,null," "]
[" "," "," "," "," ",null,null,null," "]
[" "," "," "," "," ",null,null,null," "]
[" "," "," "," "," ",null,null,null," "]
[" "," "," "," "," ",null,null,null," "]
[" "," "," "," "," ",null,null,null," "]
[" "," "," "," "," ",null,null,null," "]
[" "," "," "," "," ",null,null,null," "]
[" "," "," "," "," ",null,null,null," "]
[" "," "," "," "," ",null,null,null," "]
[" "," "," "," "," ",null,null,null," "]
[" "," "," "," "," ",null,null,null," "]
[" "," "," "," "," ",null,null,null," "]
[" "," "," "," "," ",null,null,null," "]
[" "," "," "," "," ",null,null,null," "]
[" "," "," "," "," ",null,null,null," "]
[" "," "," "," "," ",null,null,null," "]
[" "," "," "," "," ",null,null,null," "]
[" "," "," "," "," ",null,null,null," "]
[" "," "," "," "," ",null,null,null," "]
[" "," "," "," "," ",null,null,null," "]
[" "," "," "," ",{"$f":"IF(A4611<>\" \",VLOOKUP(B4611,NCHEMS_ABBR,3,0),\" \")","v":" "},null,null,null," "]
[" "," "," "," "," ",null,null,null," "]
[" "," "," "," "," ",null,null,null," "]
[" "," "," "," "," ",null,null,null," "]
[" "," "," "," "," ",null,null,null," "]
[" "," "," "," "," ",null,null,null," "]
[" "," "," "," "," ",null,null,null," "]
[" "," "," "," "," ",null,null,null," "]
[" "," "," "," "," ",null,null,null," "]
[" "," "," "," "," ",null,null,null," "]
[" "," "," "," "," ",null,null,null," "]
[" "," "," "," "," ",null,null,null," "]
[" "," "," "," "," ",null,null,null,{"$f":"IF(H4623<>0,VLOOKUP(H4623,ALLOC_NCHEMS,3,0),\" \")","v":" "}]
[" "," "," "," "," ",null,null,null," "]
[" "," "," "," "," ",null,null,null," "]
[" "," "," "," "," ",null,null,null," "]
[" "," "," "," "," ",null,null,null," "]
[" "," "," "," "," ",null,null,null," "]
[" "," "," "," "," ",null,null,null," "]
[" "," "," "," "," ",null,null,null," "]
[" "," "," "," "," ",null,null,null," "]
[" "," "," "," "," ",null,null,null," "]
[" "," "," "," "," ",null,null,null," "]
[" "," "," "," "," ",null,null,null," "]
[" "," "," "," "," ",null,null,null," "]
[" "," "," "," "," ",null,null,null," "]
[" "," "," "," "," ",null,null,null," "]
[" "," "," "," "," ",null,null,null," "]
[" "," "," "," "," ",null,null,null," "]
[{"$f":"IF(F4640>0,VALUE(F4640),\" \")","v":" "},{"$f":"IF(A4640<>\" \",RIGHT(G4640,2),\" \")","v":" "},{"$f":"IF(A4640<>\" \",VLOOKUP(H4640,ALLOC_NCHEMS,2,0),\" \")","v":" "},{"$f":"IF(A4640<>\" \",VLOOKUP(I4640,ALLOC,2,0),\" \")","v":" "}," ",null,null,null," "]
[" "," "," "," "," ",null,null,null," "]
[" "," "," "," "," ",null,null,null," "]
[" "," "," "," "," ",null,null,null," "]
[" "," "," "," "," ",null,null,null," "]
[" "," "," "," "," ",null,null,null," "]
[" "," "," "," "," ",null,null,null," "]
[" "," "," "," "," ",null,null,null," "]
[" "," "," "," "," ",null,null,null," "]
[" "," "," "," "," ",null,null,null," "]
[" "," "," "," "," ",null,null,null," "]
[" "," "," "," "," ",null,null,null," "]
[" "," "," "," "," ",null,null,null," "]
[" "," "," "," "," ",null,null,null," "]
[" "," "," "," "," ",null,null,null," "]
[" "," "," "," "," ",null,null,null," "]
[" "," "," "," "," ",null,null,null," "]
[" "," "," "," "," ",null,null,null," "]
[" "," "," "," "," ",null,null,null," "]
[" "," "," "," "," ",null,null,null," "]
[" "," "," "," "," ",null,null,null," "]
[" "," "," "," "," ",null,null,null," "]
[" "," "," "," "," ",null,null,null," "]
[" "," "," "," "," ",null,null,null," "]
[" "," "," "," "," ",null,null,null," "]
[" "," "," "," "," ",null,null,null," "]
[" "," "," "," "," ",null,null,null," "]
[" "," "," "," "," ",null,null,null," "]
[" "," "," "," "," ",null,null,null," "]
[" "," "," "," "," ",null,null,null," "]
[" "," "," "," "," ",null,null,null," "]
[" "," "," "," "," ",null,null,null," "]
[" "," "," "," "," ",null,null,null," "]
[" "," "," "," "," ",null,null,null," "]
[" "," "," "," "," ",null,null,null," "]
[" "," "," "," ",{"$f":"IF(A4675<>\" \",VLOOKUP(B4675,NCHEMS_ABBR,3,0),\" \")","v":" "},null,null,null," "]
[" "," "," "," "," ",null,null,null," "]
[" "," "," "," "," ",null,null,null," "]
[" "," "," "," "," ",null,null,null," "]
[" "," "," "," "," ",null,null,null," "]
[" "," "," "," "," ",null,null,null," "]
[" "," "," "," "," ",null,null,null," "]
[" "," "," "," "," ",null,null,null," "]
[" "," "," "," "," ",null,null,null," "]
[" "," "," "," "," ",null,null,null," "]
[" "," "," "," "," ",null,null,null," "]
[" "," "," "," "," ",null,null,null," "]
[" "," "," "," "," ",null,null,null,{"$f":"IF(H4687<>0,VLOOKUP(H4687,ALLOC_NCHEMS,3,0),\" \")","v":" "}]
[" "," "," "," "," ",null,null,null," "]
[" "," "," "," "," ",null,null,null," "]
[" "," "," "," "," ",null,null,null," "]
[" "," "," "," "," ",null,null,null," "]
[" "," "," "," "," ",null,null,null," "]
[" "," "," "," "," ",null,null,null," "]
[" "," "," "," "," ",null,null,null," "]
[" "," "," "," "," ",null,null,null," "]
[" "," "," "," "," ",null,null,null," "]
[" "," "," "," "," ",null,null,null," "]
[" "," "," "," "," ",null,null,null," "]
[" "," "," "," "," ",null,null,null," "]
[" "," "," "," "," ",null,null,null," "]
[" "," "," "," "," ",null,null,null," "]
[" "," "," "," "," ",null,null,null," "]
[" "," "," "," "," ",null,null,null," "]
[{"$f":"IF(F4704>0,VALUE(F4704),\" \")","v":" "},{"$f":"IF(A4704<>\" \",RIGHT(G4704,2),\" \")","v":" "},{"$f":"IF(A4704<>\" \",VLOOKUP(H4704,ALLOC_NCHEMS,2,0),\" \")","v":" "},{"$f":"IF(A4704<>\" \",VLOOKUP(I4704,ALLOC,2,0),\" \")","v":" "}," ",null,null,null," "]
[" "," "," "," "," ",null,null,null," "]
[" "," "," "," "," ",null,null,null," "]
[" "," "," "," "," ",null,null,null," "]
[" "," "," "," "," ",null,null,null," "]
[" "," "," "," "," ",null,null,null," "]
[" "," "," "," "," ",null,null,null," "]
[" "," "," "," "," ",null,null,null," "]
[" "," "," "," "," ",null,null,null," "]
[" "," "," "," "," ",null,null,null," "]
[" "," "," "," "," ",null,null,null," "]
[" "," "," "," "," ",null,null,null," "]
[" "," "," "," "," ",null,null,null," "]
[" "," "," "," "," ",null,null,null," "]
[" "," "," "," "," ",null,null,null," "]
[" "," "," "," "," ",null,null,null," "]
[" "," "," "," "," ",null,null,null," "]
[" "," "," "," "," ",null,null,null," "]
[" "," "," "," "," ",null,null,null," "]
[" "," "," "," "," ",null,null,null," "]
[" "," "," "," "," ",null,null,null," "]
[" "," "," "," "," ",null,null,null," "]
[" "," "," "," "," ",null,null,null," "]
[" "," "," "," "," ",null,null,null," "]
[" "," "," "," "," ",null,null,null," "]
[" "," "," "," "," ",null,null,null," "]
[" "," "," "," "," ",null,null,null," "]
[" "," "," "," "," ",null,null,null," "]
[" "," "," "," "," ",null,null,null," "]
[" "," "," "," "," ",null,null,null," "]
[" "," "," "," "," ",null,null,null," "]
[" "," "," "," "," ",null,null,null," "]
[" "," "," "," "," ",null,null,null," "]
[" "," "," "," "," ",null,null,null," "]
[" "," "," "," "," ",null,null,null," "]
[" "," "," "," ",{"$f":"IF(A4739<>\" \",VLOOKUP(B4739,NCHEMS_ABBR,3,0),\" \")","v":" "},null,null,null," "]
[" "," "," "," "," ",null,null,null," "]
[" "," "," "," "," ",null,null,null," "]
[" "," "," "," "," ",null,null,null," "]
[" "," "," "," "," ",null,null,null," "]
[" "," "," "," "," ",null,null,null," "]
[" "," "," "," "," ",null,null,null," "]
[" "," "," "," "," ",null,null,null," "]
[" "," "," "," "," ",null,null,null," "]
[" "," "," "," "," ",null,null,null," "]
[" "," "," "," "," ",null,null,null," "]
[" "," "," "," "," ",null,null,null," "]
[" "," "," "," "," ",null,null,null,{"$f":"IF(H4751<>0,VLOOKUP(H4751,ALLOC_NCHEMS,3,0),\" \")","v":" "}]
[" "," "," "," "," ",null,null,null," "]
[" "," "," "," "," ",null,null,null," "]
[" "," "," "," "," ",null,null,null," "]
[" "," "," "," "," ",null,null,null," "]
[" "," "," "," "," ",null,null,null," "]
[" "," "," "," "," ",null,null,null," "]
[" "," "," "," "," ",null,null,null," "]
[" "," "," "," "," ",null,null,null," "]
[" "," "," "," "," ",null,null,null," "]
[" "," "," "," "," ",null,null,null," "]
[" "," "," "," "," ",null,null,null," "]
[" "," "," "," "," ",null,null,null," "]
[" "," "," "," "," ",null,null,null," "]
[" "," "," "," "," ",null,null,null," "]
[" "," "," "," "," ",null,null,null," "]
[" "," "," "," "," ",null,null,null," "]
[{"$f":"IF(F4768>0,VALUE(F4768),\" \")","v":" "},{"$f":"IF(A4768<>\" \",RIGHT(G4768,2),\" \")","v":" "},{"$f":"IF(A4768<>\" \",VLOOKUP(H4768,ALLOC_NCHEMS,2,0),\" \")","v":" "},{"$f":"IF(A4768<>\" \",VLOOKUP(I4768,ALLOC,2,0),\" \")","v":" "}," ",null,null,null," "]
[" "," "," "," "," ",null,null,null," "]
[" "," "," "," "," ",null,null,null," "]
[" "," "," "," "," ",null,null,null," "]
[" "," "," "," "," ",null,null,null," "]
[" "," "," "," "," ",null,null,null," "]
[" "," "," "," "," ",null,null,null," "]
[" "," "," "," "," ",null,null,null," "]
[" "," "," "," "," ",null,null,null," "]
[" "," "," "," "," ",null,null,null," "]
[" "," "," "," "," ",null,null,null," "]
[" "," "," "," "," ",null,null,null," "]
[" "," "," "," "," ",null,null,null," "]
[" "," "," "," "," ",null,null,null," "]
[" "," "," "," "," ",null,null,null," "]
[" "," "," "," "," ",null,null,null," "]
[" "," "," "," "," ",null,null,null," "]
[" "," "," "," "," ",null,null,null," "]
[" "," "," "," "," ",null,null,null," "]
[" "," "," "," "," ",null,null,null," "]
[" "," "," "," "," ",null,null,null," "]
[" "," "," "," "," ",null,null,null," "]
[" "," "," "," "," ",null,null,null," "]
[" "," "," "," "," ",null,null,null," "]
[" "," "," "," "," ",null,null,null," "]
[" "," "," "," "," ",null,null,null," "]
[" "," "," "," "," ",null,null,null," "]
[" "," "," "," "," ",null,null,null," "]
[" "," "," "," "," ",null,null,null," "]
[" "," "," "," "," ",null,null,null," "]
[" "," "," "," "," ",null,null,null," "]
[" "," "," "," "," ",null,null,null," "]
[" "," "," "," "," ",null,null,null," "]
[" "," "," "," "," ",null,null,null," "]
[" "," "," "," "," ",null,null,null," "]
[" "," "," "," ",{"$f":"IF(A4803<>\" \",VLOOKUP(B4803,NCHEMS_ABBR,3,0),\" \")","v":" "},null,null,null," "]
[" "," "," "," "," ",null,null,null," "]
[" "," "," "," "," ",null,null,null," "]
[" "," "," "," "," ",null,null,null," "]
[" "," "," "," "," ",null,null,null," "]
[" "," "," "," "," ",null,null,null," "]
[" "," "," "," "," ",null,null,null," "]
[" "," "," "," "," ",null,null,null," "]
[" "," "," "," "," ",null,null,null," "]
[" "," "," "," "," ",null,null,null," "]
[" "," "," "," "," ",null,null,null," "]
[" "," "," "," "," ",null,null,null," "]
[" "," "," "," "," ",null,null,null,{"$f":"IF(H4815<>0,VLOOKUP(H4815,ALLOC_NCHEMS,3,0),\" \")","v":" "}]
[" "," "," "," "," ",null,null,null," "]
[" "," "," "," "," ",null,null,null," "]
[" "," "," "," "," ",null,null,null," "]
[" "," "," "," "," ",null,null,null," "]
[" "," "," "," "," ",null,null,null," "]
[" "," "," "," "," ",null,null,null," "]
[" "," "," "," "," ",null,null,null," "]
[" "," "," "," "," ",null,null,null," "]
[" "," "," "," "," ",null,null,null," "]
[" "," "," "," "," ",null,null,null," "]
[" "," "," "," "," ",null,null,null," "]
[" "," "," "," "," ",null,null,null," "]
[" "," "," "," "," ",null,null,null," "]
[" "," "," "," "," ",null,null,null," "]
[" "," "," "," "," ",null,null,null," "]
[" "," "," "," "," ",null,null,null," "]
[{"$f":"IF(F4832>0,VALUE(F4832),\" \")","v":" "},{"$f":"IF(A4832<>\" \",RIGHT(G4832,2),\" \")","v":" "},{"$f":"IF(A4832<>\" \",VLOOKUP(H4832,ALLOC_NCHEMS,2,0),\" \")","v":" "},{"$f":"IF(A4832<>\" \",VLOOKUP(I4832,ALLOC,2,0),\" \")","v":" "}," ",null,null,null," "]
[" "," "," "," "," ",null,null,null," "]
[" "," "," "," "," ",null,null,null," "]
[" "," "," "," "," ",null,null,null," "]
[" "," "," "," "," ",null,null,null," "]
[" "," "," "," "," ",null,null,null," "]
[" "," "," "," "," ",null,null,null," "]
[" "," "," "," "," ",null,null,null," "]
[" "," "," "," "," ",null,null,null," "]
[" "," "," "," "," ",null,null,null," "]
[" "," "," "," "," ",null,null,null," "]
[" "," "," "," "," ",null,null,null," "]
[" "," "," "," "," ",null,null,null," "]
[" "," "," "," "," ",null,null,null," "]
[" "," "," "," "," ",null,null,null," "]
[" "," "," "," "," ",null,null,null," "]
[" "," "," "," "," ",null,null,null," "]
[" "," "," "," "," ",null,null,null," "]
[" "," "," "," "," ",null,null,null," "]
[" "," "," "," "," ",null,null,null," "]
[" "," "," "," "," ",null,null,null," "]
[" "," "," "," "," ",null,null,null," "]
[" "," "," "," "," ",null,null,null," "]
[" "," "," "," "," ",null,null,null," "]
[" "," "," "," "," ",null,null,null," "]
[" "," "," "," "," ",null,null,null," "]
[" "," "," "," "," ",null,null,null," "]
[" "," "," "," "," ",null,null,null," "]
[" "," "," "," "," ",null,null,null," "]
[" "," "," "," "," ",null,null,null," "]
[" "," "," "," "," ",null,null,null," "]
[" "," "," "," "," ",null,null,null," "]
[" "," "," "," "," ",null,null,null," "]
[" "," "," "," "," ",null,null,null," "]
[" "," "," "," "," ",null,null,null," "]
[" "," "," "," ",{"$f":"IF(A4867<>\" \",VLOOKUP(B4867,NCHEMS_ABBR,3,0),\" \")","v":" "},null,null,null," "]
[" "," "," "," "," ",null,null,null," "]
[" "," "," "," "," ",null,null,null," "]
[" "," "," "," "," ",null,null,null," "]
[" "," "," "," "," ",null,null,null," "]
[" "," "," "," "," ",null,null,null," "]
[" "," "," "," "," ",null,null,null," "]
[" "," "," "," "," ",null,null,null," "]
[" "," "," "," "," ",null,null,null," "]
[" "," "," "," "," ",null,null,null," "]
[" "," "," "," "," ",null,null,null," "]
[" "," "," "," "," ",null,null,null," "]
[" "," "," "," "," ",null,null,null,{"$f":"IF(H4879<>0,VLOOKUP(H4879,ALLOC_NCHEMS,3,0),\" \")","v":" "}]
[" "," "," "," "," ",null,null,null," "]
[" "," "," "," "," ",null,null,null," "]
[" "," "," "," "," ",null,null,null," "]
[" "," "," "," "," ",null,null,null," "]
[" "," "," "," "," ",null,null,null," "]
[" "," "," "," "," ",null,null,null," "]
[" "," "," "," "," ",null,null,null," "]
[" "," "," "," "," ",null,null,null," "]
[" "," "," "," "," ",null,null,null," "]
[" "," "," "," "," ",null,null,null," "]
[" "," "," "," "," ",null,null,null," "]
[" "," "," "," "," ",null,null,null," "]
[" "," "," "," "," ",null,null,null," "]
[" "," "," "," "," ",null,null,null," "]
[" "," "," "," "," ",null,null,null," "]
[" "," "," "," "," ",null,null,null," "]
[{"$f":"IF(F4896>0,VALUE(F4896),\" \")","v":" "},{"$f":"IF(A4896<>\" \",RIGHT(G4896,2),\" \")","v":" "},{"$f":"IF(A4896<>\" \",VLOOKUP(H4896,ALLOC_NCHEMS,2,0),\" \")","v":" "},{"$f":"IF(A4896<>\" \",VLOOKUP(I4896,ALLOC,2,0),\" \")","v":" "}," ",null,null,null," "]
[" "," "," "," "," ",null,null,null," "]
[" "," "," "," "," ",null,null,null," "]
[" "," "," "," "," ",null,null,null," "]
[" "," "," "," "," ",null,null,null," "]
[" "," "," "," "," ",null,null,null," "]
[" "," "," "," "," ",null,null,null," "]
[" "," "," "," "," ",null,null,null," "]
[" "," "," "," "," ",null,null,null," "]
[" "," "," "," "," ",null,null,null," "]
[" "," "," "," "," ",null,null,null," "]
[" "," "," "," "," ",null,null,null," "]
[" "," "," "," "," ",null,null,null," "]
[" "," "," "," "," ",null,null,null," "]
[" "," "," "," "," ",null,null,null," "]
[" "," "," "," "," ",null,null,null," "]
[" "," "," "," "," ",null,null,null," "]
[" "," "," "," "," ",null,null,null," "]
[" "," "," "," "," ",null,null,null," "]
[" "," "," "," "," ",null,null,null," "]
[" "," "," "," "," ",null,null,null," "]
[" "," "," "," "," ",null,null,null," "]
[" "," "," "," "," ",null,null,null," "]
[" "," "," "," "," ",null,null,null," "]
[" "," "," "," "," ",null,null,null," "]
[" "," "," "," "," ",null,null,null," "]
[" "," "," "," "," ",null,null,null," "]
[" "," "," "," "," ",null,null,null," "]
[" "," "," "," "," ",null,null,null," "]
[" "," "," "," "," ",null,null,null," "]
[" "," "," "," "," ",null,null,null," "]
[" "," "," "," "," ",null,null,null," "]
[" "," "," "," "," ",null,null,null," "]
[" "," "," "," "," ",null,null,null," "]
[" "," "," "," "," ",null,null,null," "]
[" "," "," "," ",{"$f":"IF(A4931<>\" \",VLOOKUP(B4931,NCHEMS_ABBR,3,0),\" \")","v":" "},null,null,null," "]
[" "," "," "," "," ",null,null,null," "]
[" "," "," "," "," ",null,null,null," "]
[" "," "," "," "," ",null,null,null," "]
[" "," "," "," "," ",null,null,null," "]
[" "," "," "," "," ",null,null,null," "]
[" "," "," "," "," ",null,null,null," "]
[" "," "," "," "," ",null,null,null," "]
[" "," "," "," "," ",null,null,null," "]
[" "," "," "," "," ",null,null,null," "]
[" "," "," "," "," ",null,null,null," "]
[" "," "," "," "," ",null,null,null," "]
[" "," "," "," "," ",null,null,null,{"$f":"IF(H4943<>0,VLOOKUP(H4943,ALLOC_NCHEMS,3,0),\" \")","v":" "}]
[" "," "," "," "," ",null,null,null," "]
[" "," "," "," "," ",null,null,null," "]
[" "," "," "," "," ",null,null,null," "]
[" "," "," "," "," ",null,null,null," "]
[" "," "," "," "," ",null,null,null," "]
[" "," "," "," "," ",null,null,null," "]
[" "," "," "," "," ",null,null,null," "]
[" "," "," "," "," ",null,null,null," "]
[" "," "," "," "," ",null,null,null," "]
[" "," "," "," "," ",null,null,null," "]
[" "," "," "," "," ",null,null,null," "]
[" "," "," "," "," ",null,null,null," "]
[" "," "," "," "," ",null,null,null," "]
[" "," "," "," "," ",null,null,null," "]
[" "," "," "," "," ",null,null,null," "]
[" "," "," "," "," ",null,null,null," "]
[{"$f":"IF(F4960>0,VALUE(F4960),\" \")","v":" "},{"$f":"IF(A4960<>\" \",RIGHT(G4960,2),\" \")","v":" "},{"$f":"IF(A4960<>\" \",VLOOKUP(H4960,ALLOC_NCHEMS,2,0),\" \")","v":" "},{"$f":"IF(A4960<>\" \",VLOOKUP(I4960,ALLOC,2,0),\" \")","v":" "}," ",null,null,null," "]
[" "," "," "," "," ",null,null,null," "]
[" "," "," "," "," ",null,null,null," "]
[" "," "," "," "," ",null,null,null," "]
[" "," "," "," "," ",null,null,null," "]
[" "," "," "," "," ",null,null,null," "]
[" "," "," "," "," ",null,null,null," "]
[" "," "," "," "," ",null,null,null," "]
[" "," "," "," "," ",null,null,null," "]
[" "," "," "," "," ",null,null,null," "]
[" "," "," "," "," ",null,null,null," "]
[" "," "," "," "," ",null,null,null," "]
[" "," "," "," "," ",null,null,null," "]
[" "," "," "," "," ",null,null,null," "]
[" "," "," "," "," ",null,null,null," "]
[" "," "," "," "," ",null,null,null," "]
[" "," "," "," "," ",null,null,null," "]
[" "," "," "," "," ",null,null,null," "]
[" "," "," "," "," ",null,null,null," "]
[" "," "," "," "," ",null,null,null," "]
[" "," "," "," "," ",null,null,null," "]
[" "," "," "," "," ",null,null,null," "]
[" "," "," "," "," ",null,null,null," "]
[" "," "," "," "," ",null,null,null," "]
[" "," "," "," "," ",null,null,null," "]
[" "," "," "," "," ",null,null,null," "]
[" "," "," "," "," ",null,null,null," "]
[" "," "," "," "," ",null,null,null," "]
[" "," "," "," "," ",null,null,null," "]
[" "," "," "," "," ",null,null,null," "]
[" "," "," "," "," ",null,null,null," "]
[" "," "," "," "," ",null,null,null," "]
[" "," "," "," "," ",null,null,null," "]
[" "," "," "," "," ",null,null,null," "]
[" "," "," "," "," ",null,null,null," "]
[" "," "," "," ",{"$f":"IF(A4995<>\" \",VLOOKUP(B4995,NCHEMS_ABBR,3,0),\" \")","v":" "},null,null,null," "]
[" "," "," "," "," ",null,null,null," "]
[" "," "," "," "," ",null,null,null," "]
[" "," "," "," "," ",null,null,null," "]
[" "," "," "," "," ",null,null,null," "]
[" "," "," "," "," ",null,null,null," "]

{"sheet":"ACCT","index":7,"n_rows":686,"n_cols":12,"rows_kept":686,"cut":false,"hidden":true,"merged":[]}
["ACCT","ACCT TITLE","ACCT TYPE","ACCT TYPE TITLE","ATYP PRED","ATYP PRED TITLE","ACCT PRED","ACCT PRED TITLE","GROUP","GROUP TITLE","ACCT DESIGNATOR","GROUP"]
[1001,"Personal Services Budget","PS","Personal Services Costs",60,"Labor","WAGES","Personal Services","E1","Personal Services",60,"E1"]
[1005,"Construction Sal Transfer","PS","Personal Services Costs",60,"Labor","WAGES","Personal Services","E2","Travel",9212,"R11"]
[1101,"Faculty - UNAC Barg Unit < 12 month","PS","Personal Services Costs",60,"Labor","PERM","Permanent Salaries","E3","Contractual Services",9222,"R5"]
[1102,"Faculty-UAFT Barg Unit < 12 month","PS","Personal Services Costs",60,"Labor","PERM","Permanent Salaries","E4","Supplies",9224,"R8"]
[1150,"Faculty-Non-Barg Unit < 12 Month","PS","Personal Services Costs",60,"Labor","PERM","Permanent Salaries","E5","Equipment / Other Capital","5ART","E5"]
[1151,"Faculty - Non-barg Unit - 12 month","PS","Personal Services Costs",60,"Labor","PERM","Permanent Salaries","E6","Land / Buildings","5BUD","E5"]
[1152,"Faculty - UAFT Barg Unit - 12 Month","PS","Personal Services Costs",60,"Labor","PERM","Permanent Salaries","E7","Grants / Claims / Student Aid","5BUILD","E6"]
[1201,"Executive","PS","Personal Services Costs",60,"Labor","PERM","Permanent Salaries","E8","Miscellaneous","5CIP","E6"]
[1251,"APT","PS","Personal Services Costs",60,"Labor","PERM","Permanent Salaries","E9","Indirect Cost Recovery","5EQUIP","E5"]
[1401,"Classified (Non-exempt)","PS","Personal Services Costs",60,"Labor","PERM","Permanent Salaries","R1","Auxiliary Receipts","5INFRA","E6"]
[1501,"Local 6070 Bargaining Unit","PS","Personal Services Costs",60,"Labor","PERM","Permanent Salaries","R2","CIP Receipts","5INTAN","E5"]
[1601,"Adjunct Faculty Bargaining Unit","PS","Personal Services Costs",60,"Labor","TEMP","Temporary Salaries","R3","Federal Receipts","5LAND","E6"]
[1602,"Adjunct Faculty Non-bargaining Unit","PS","Personal Services Costs",60,"Labor","TEMP","Temporary Salaries","R4","General Fund","5LBRY","E5"]
[1611,"Faculty-UNAC Summer Assign/Overload","PS","Personal Services Costs",60,"Labor","TEMP","Temporary Salaries","R5","General Fund Match","9APCTY","R13"]
[1612,"Faculty-UAFT Summer Assign Overload","PS","Personal Services Costs",60,"Labor","TEMP","Temporary Salaries","R6","Indirect Cost Recovery","9APFED","R3"]
[1613,"Faculty-Non-Barg.Summer Assign/Over","PS","Personal Services Costs",60,"Labor","TEMP","Temporary Salaries","R7","Interest Income","9APGEN","R4"]
[1615,"APT Temporary","PS","Personal Services Costs",60,"Labor","TEMP","Temporary Salaries","R8","Mental Health Trust","9APNGN","R4"]
[1617,"APT Extended Temporary","PS","Personal Services Costs",60,"Labor","TEMP","Temporary Salaries","R9","State Inter-Agency Receipts","9AUXRV","R1"]
[1620,"Classified (Non-Exempt) Temporary","PS","Personal Services Costs",60,"Labor","TEMP","Temporary Salaries","R10","Student Tuition & Fees","9BOND","R13"]
[1627,"Classif (Non-exempt) Ext Temporary","PS","Personal Services Costs",60,"Labor","TEMP","Temporary Salaries","R11","Tech Voc Educ Program","9CIPRV","R2"]
[1630,"Local 6070 Union - Temporary","PS","Personal Services Costs",60,"Labor","TEMP","Temporary Salaries","R12","UA Intra-Agency Receipts","9CTYGC","R13"]
[1640,"Student Wages - Not Subject to FICA","PS","Personal Services Costs",60,"Labor","STDNT","Student Salaries","R13","University Receipts","9ENDW","R13"]
[1641,"Student Wages - Subject to FICA","PS","Personal Services Costs",60,"Labor","STDNT","Student Salaries",null,null,"9EST","R13"]
[1643,"Grad Student Wages-Not Sub to FICA","PS","Personal Services Costs",60,"Labor","STDNT","Student Salaries",null,null,"9FEDGC","R3"]
[1644,"Grad Student Wages - Subjec to FICA","PS","Personal Services Costs",60,"Labor","STDNT","Student Salaries",null,null,"9FEES","R10"]
[1646,"Student - CWS No FICA","PS","Personal Services Costs",60,"Labor","STDNT","Student Salaries",null,null,"9GIFTS","R13"]
[1647,"Student - CWS - Subject to FICA","PS","Personal Services Costs",60,"Labor","STDNT","Student Salaries",null,null,"9IDNRV","R6"]
[1651,"Overtime - Straight","PS","Personal Services Costs",60,"Labor","OTP","Overtime Permanent",null,null,"9INTST","R7"]
[1671,"Overtime - Premium","PS","Personal Services Costs",60,"Labor","OTP","Overtime Permanent",null,null,"9OTHRV","R13"]
[1711,"Modified Duty","PS","Personal Services Costs",60,"Labor","SPAY","Special Pay",null,null,"9PRGC","R13"]
[1741,"Duty Station Differential","PS","Personal Services Costs",60,"Labor","SPAY","Special Pay",null,null,"9SALE","R13"]
[1761,"Awards","PS","Personal Services Costs",60,"Labor","SPAY","Special Pay",null,null,"9STGC","R9"]
[1765,"Retirmnt Incentive Bonus","PS","Personal Services Costs",60,"Labor","SPAY","Special Pay",null,null,"9TRNF","R12"]
[1766,"Relocation","PS","Personal Services Costs",60,"Labor","SPAY","Special Pay",null,null,"9TUIT","R10"]
[1811,"Annual Leave Charge","PS","Personal Services Costs",60,"Labor","ALC","Annual Leave Charges",null,null,"AD","E7"]
[1812,"Annual Leave Recovery","PS","Personal Services Costs",60,"Labor","ALR","Annual Leave Recovery",null,null,"CM","E4"]
[1815,"Annual Leave-Taken","PS","Personal Services Costs",60,"Labor","ALT","Annual Leave Taken",null,null,"IC","E9"]
[1816,"Annual Leave Liability Adj.","PS","Personal Services Costs",60,"Labor","ALM","Annual Leave Misc",null,null,"MS","E8"]
[1819,"Post Employment Benefit Cost","PS","Personal Services Costs",60,"Labor","ALM","Annual Leave Misc",null,null,"NMNTRF","R12"]
[1831,"Sick Leave Charge","PS","Personal Services Costs",60,"Labor","SLC","Sick Leave Charges",null,null,"OTHTRF","R12"]
[1832,"Sick Leave Recovery","PS","Personal Services Costs",60,"Labor","SLR","Sick Leave Recovery",null,null,"RS","E4"]
[1835,"Sick Leave Taken","PS","Personal Services Costs",60,"Labor","SLT","Sick Leave Taken",null,null,"SV","E3"]
[1836,"Sick Leave Payback-W/C","PS","Personal Services Costs",60,"Labor","SLM","Sick Leave Misc",null,null,"TL","E2"]
[1841,"Holiday Leave-Charge","PS","Personal Services Costs",60,"Labor","HLC","Holiday Leave Charges"]
[1842,"Holiday Leave Recovery","PS","Personal Services Costs",60,"Labor","HLR","Holiday Leave Recovery"]
[1845,"Holiday Leave Taken","PS","Personal Services Costs",60,"Labor","HLT","Holiday Leave Taken"]
[1855,"Military Leave Taken","PS","Personal Services Costs",60,"Labor","MLT","Military Leave Taken"]
[1860,"Search/Rescue Leave","PS","Personal Services Costs",60,"Labor","MLM","Miscellanous"]
[1865,"Jury Duty Taken","PS","Personal Services Costs",60,"Labor","JRT","Jury Leave Taken"]
[1866,"Jury Duty Pay Back","PS","Personal Services Costs",60,"Labor","MLM","Miscellanous"]
[1871,"UAFT Leave Bank Transfer Out","PS","Personal Services Costs",60,"Labor","CBU","Collective Barg Unit"]
[1872,"UAFT Leave Bank Transfer In","PS","Personal Services Costs",60,"Labor","CBU","Collective Barg Unit"]
[1875,"UAFT Leave Bank Usage","PS","Personal Services Costs",60,"Labor","CBU","Collective Barg Unit"]
[1881,"Local 6070 Leave Bank Transfer Out","PS","Personal Services Costs",60,"Labor","CBU","Collective Barg Unit"]
[1882,"Local 6070 Leave Bank Transfer In","PS","Personal Services Costs",60,"Labor","CBU","Collective Barg Unit"]
[1885,"Local 6070 Leave Bank Usage","PS","Personal Services Costs",60,"Labor","CBU","Collective Barg Unit"]
[1891,"UAFFA Leave bank Transfer Out","PS","Personal Services Costs",60,"Labor","CBU","Collective Barg Unit"]
[1892,"UAFFA Leave Bank Transfer In","PS","Personal Services Costs",60,"Labor","CBU","Collective Barg Unit"]
[1895,"UAFFA Leave Bank usage","PS","Personal Services Costs",60,"Labor","CBU","Collective Barg Unit"]
[1901,"FICA (OASDI) UA Cost","SB","Staff Benefits",60,"Labor","EMPR","Employer Mandatory Portion"]
[1902,"Medicare UA Cost","SB","Staff Benefits",60,"Labor","EMPR","Employer Mandatory Portion"]
[1903,"Pension Plan","SB","Staff Benefits",60,"Labor","EMPR","Employer Mandatory Portion"]
[1904,"Admin Cost Pension Plan","SB","Staff Benefits",60,"Labor","SBOTHR","Staff Benefits Other"]
[1905,"Admin Fees - HSA","SB","Staff Benefits",60,"Labor","SBOTHR","Staff Benefits Other"]
[1906,"Pension Forfeitures","SB","Staff Benefits",60,"Labor","EMPR","Employer Mandatory Portion"]
[1910,"Teachers Retirement Systm","SB","Staff Benefits",60,"Labor","EMPR","Employer Mandatory Portion"]
[1912,"ORP Retirement Benefit","SB","Staff Benefits",60,"Labor","EMPR","Employer Mandatory Portion"]
[1913,"ORP Forfeitures","SB","Staff Benefits",60,"Labor","EMPR","Employer Mandatory Portion"]
[1915,"Public Employees Retiremt","SB","Staff Benefits",60,"Labor","EMPR","Employer Mandatory Portion"]
[1916,"Retiremt Incent Prg Costs","SB","Staff Benefits",60,"Labor","SBOTHR","Staff Benefits Other"]
[1917,"Civil Service Retirement","SB","Staff Benefits",60,"Labor","EMPR","Employer Mandatory Portion"]
[1918,"Civil Service Insurance","SB","Staff Benefits",60,"Labor","EMPRLF","Employer Life Insurance Cost"]
[1920,"Health Claims","SB","Staff Benefits",60,"Labor","EMPRHL","Employer Health Program"]
[1921,"Admin Cost-Health Program","SB","Staff Benefits",60,"Labor","EMPRHL","Employer Health Program"]
[1922,"COBRA Outsourcing","SB","Staff Benefits",60,"Labor","EMPRHL","Employer Health Program"]
[1923,"Health Liability Adj","SB","Staff Benefits",60,"Labor","EMPRHL","Employer Health Program"]
[1924,"Employee Flexible Spend.","SB","Staff Benefits",60,"Labor","EMPRHL","Employer Health Program"]
[1925,"Life Insurance","SB","Staff Benefits",60,"Labor","EMPRLF","Employer Life Insurance Cost"]
[1926,"Health Insurance Premium","SB","Staff Benefits",60,"Labor","EMPRHL","Employer Health Program"]
[1927,"Empl Required Physical","SB","Staff Benefits",60,"Labor","EMPRHL","Employer Health Program"]
[1929,"Wellness Program","SB","Staff Benefits",60,"Labor","EMPRHL","Employer Health Program"]
[1930,"Workers Compensation","SB","Staff Benefits",60,"Labor","SBOTHR","Staff Benefits Other"]
[1931,"Employee Assistance Program","SB","Staff Benefits",60,"Labor","EMPRHL","Employer Health Program"]
[1932,"Labor Relations Expense","SB","Staff Benefits",60,"Labor","SBOTHR","Staff Benefits Other"]
[1933,"Local 6070 Contract Costs","SB","Staff Benefits",60,"Labor","SBOTHR","Staff Benefits Other"]
[1935,"Long Term Disability","SB","Staff Benefits",60,"Labor","EMPRHL","Employer Health Program"]
[1940,"Unemployment Compensation","SB","Staff Benefits",60,"Labor","SBOTHR","Staff Benefits Other"]
[1945,"Civil Service Coverage","SB","Staff Benefits",60,"Labor","SBOTHR","Staff Benefits Other"]
[1947,"Lawsuit and other settlements","SB","Staff Benefits",60,"Labor","SBOTHR","Staff Benefits Other"]
[1948,"Taxable Non Cash Benefits","SB","Staff Benefits",60,"Labor","SBOTHR","Staff Benefits Other"]
[1949,"Health Insurance Premiums Grad Assi","SB","Staff Benefits",60,"Labor","SBOTHR","Staff Benefits Other"]
[1950,"Staff Benefits - Consulting","SB","Staff Benefits",60,"Labor","SBDIR","Staff Benefits Direct Costs"]
[1951,"S/B Duplic & Office Costs","SB","Staff Benefits",60,"Labor","SBDIR","Staff Benefits Direct Costs"]
[1952,"Staff Benefits - Travel","SB","Staff Benefits",60,"Labor","SBDIR","Staff Benefits Direct Costs"]
[1955,"Staff Educ About Benefits","SB","Staff Benefits",60,"Labor","SBDIR","Staff Benefits Direct Costs"]
[1970,"Staff Benefits Expense","SB","Staff Benefits",60,"Labor","SBEXP","Staff Benefits Expense"]
[1972,"Staff Benefit Recovery","SB","Staff Benefits",60,"Labor","SBREC","Staff Benefits Recovery"]
[1973,"COBRA/LWOP Health Payment","SB","Staff Benefits",60,"Labor","EMPRHL","Employer Health Program"]
[1976,"Supp Health Recovery","SB","Staff Benefits",60,"Labor","EMPRHL","Employer Health Program"]
[1977,"Spouse/Dependent Health","SB","Staff Benefits",60,"Labor","EMPRHL","Employer Health Program"]
[1978,"Employee Defined Contribution","SB","Staff Benefits",60,"Labor","SBREC","Staff Benefits Recovery"]
[1985,"Employee Tuition Waivers","SB","Staff Benefits",60,"Labor","SBOTHR","Staff Benefits Other"]
[1986,"Dependent/Spouse Tuition Waivers","SB","Staff Benefits",60,"Labor","SBUNAL","Staff Benefits Unallowable"]
[1987,"Adjuncts Dep/Spouse Tuition Waivers","SB","Staff Benefits",60,"Labor","SBUNAL","Staff Benefits Unallowable"]
[1991,"Local Employer Payroll Taxes","SB","Staff Benefits",60,"Labor","EMPR","Employer Mandatory Portion"]
[2001,"Travel Budget","TL","Travel",70,"Direct Expenditures","2BUD","Budget "]
[2006,"Local Transportation","TL","Travel",70,"Direct Expenditures","2LOC","Local Travel"]
[2010,"Alaska General Administrative","TL","Travel",70,"Direct Expenditures","2IN","Instate Travel"]
[2021,"Alaska Program and Project Admin","TL","Travel",70,"Direct Expenditures","2IN","Instate Travel"]
[2022,"Alaska Workshop/Symposium Non-Admin","TL","Travel",70,"Direct Expenditures","2IN","Instate Travel"]
[2025,"Alaska Program/Field Work","TL","Travel",70,"Direct Expenditures","2IN","Instate Travel"]
[2030,"Alaska Employee Training/Developmt","TL","Travel",70,"Direct Expenditures","2IN","Instate Travel"]
[2040,"AK Athletic Competitions","TL","Travel",70,"Direct Expenditures","2IN","Instate Travel"]
[2050,"Visiting Professional","TL","Travel",70,"Direct Expenditures","2IN","Instate Travel"]
[2051,"Visiting Students & Other","TL","Travel",70,"Direct Expenditures","2IN","Instate Travel"]
[2060,"AK Faculty/Staff UA Instruction","TL","Travel",70,"Direct Expenditures","2IN","Instate Travel"]
[2070,"Alaska UA Student Instructional","TL","Travel",70,"Direct Expenditures","2IN","Instate Travel"]
[2080,"Mileage (W-2)","TL","Travel",70,"Direct Expenditures","2LOC","Local Travel"]
[2090,"Alaska Lobbying Travel","TL","Travel",70,"Direct Expenditures","2IN","Instate Travel"]
[2110,"US General Administrative","TL","Travel",70,"Direct Expenditures","2US","US Travel"]
[2121,"US Program and Project Admin","TL","Travel",70,"Direct Expenditures","2US","US Travel"]
[2122,"US Workshop/Symposium Non-Admin","TL","Travel",70,"Direct Expenditures","2US","US Travel"]
[2125,"US Program/Field Work","TL","Travel",70,"Direct Expenditures","2US","US Travel"]
[2130,"US Employee Training/Development","TL","Travel",70,"Direct Expenditures","2US","US Travel"]
[2140,"US Athletic Competitions","TL","Travel",70,"Direct Expenditures","2US","US Travel"]
[2150,"US Visiting Professional","TL","Travel",70,"Direct Expenditures","2US","US Travel"]
[2151,"US Visiting Students and Other","TL","Travel",70,"Direct Expenditures","2US","US Travel"]
[2170,"US UA Student Instructional Travel","TL","Travel",70,"Direct Expenditures","2US","US Travel"]
[2190,"US Lobbying Travel","TL","Travel",70,"Direct Expenditures","2US","US Travel"]
[2210,"Canadian General Administrative","TL","Travel",70,"Direct Expenditures","2CAN","Canadian Travel"]
[2221,"Canadian Program and Project Admin","TL","Travel",70,"Direct Expenditures","2CAN","Canadian Travel"]
[2222,"Canada Workshop/Symposium Non-Admin","TL","Travel",70,"Direct Expenditures","2CAN","Canadian Travel"]
[2225,"Canadian Program/Field Work","TL","Travel",70,"Direct Expenditures","2CAN","Canadian Travel"]
[2230,"Canada Employee Training/Developmnt","TL","Travel",70,"Direct Expenditures","2CAN","Canadian Travel"]
[2240,"Canada Athletic Competitn","TL","Travel",70,"Direct Expenditures","2CAN","Canadian Travel"]
[2250,"Canada Visiting Professional","TL","Travel",70,"Direct Expenditures","2CAN","Canadian Travel"]
[2251,"Canada Visiting Students and Other","TL","Travel",70,"Direct Expenditures","2CAN","Canadian Travel"]
[2270,"Canada UA Student Instructional","TL","Travel",70,"Direct Expenditures","2CAN","Canadian Travel"]
[2301,"Foreign Travel Budget","TL","Travel",70,"Direct Expenditures","2BUD","Budget "]
[2310,"Foreign General Administrative","TL","Travel",70,"Direct Expenditures","2FOR","Foreign Travel"]
[2321,"Foreign Program and Project Admin","TL","Travel",70,"Direct Expenditures","2FOR","Foreign Travel"]
[2322,"Foreign Workshop/Symposium Non-Admn","TL","Travel",70,"Direct Expenditures","2FOR","Foreign Travel"]
[2325,"Foreign Program/Field Work","TL","Travel",70,"Direct Expenditures","2FOR","Foreign Travel"]
[2330,"Foreign Employee Training/Developmt","TL","Travel",70,"Direct Expenditures","2FOR","Foreign Travel"]
[2340,"Foreign Athletic Competit","TL","Travel",70,"Direct Expenditures","2FOR","Foreign Travel"]
[2350,"Foreign Visiting Professional","TL","Travel",70,"Direct Expenditures","2FOR","Foreign Travel"]
[2351,"Foreign Visiting Students and Other","TL","Travel",70,"Direct Expenditures","2FOR","Foreign Travel"]
[2370,"Foreign UA Student Instructional","TL","Travel",70,"Direct Expenditures","2FOR","Foreign Travel"]
[2440,"Recruitment of Students","TL","Travel",70,"Direct Expenditures","2OTHER","Other Travel"]
[2451,"Relocation","TL","Travel",70,"Direct Expenditures","2OTHER","Other Travel"]
[2452,"Recruitment","TL","Travel",70,"Direct Expenditures","2OTHER","Other Travel"]
[2501,"TEM - Airfare","TL","Travel",70,"Direct Expenditures","2TRAV","TEM Travel"]
[2502,"TEM - Lodging","TL","Travel",70,"Direct Expenditures","2TRAV","TEM Travel"]
[2503,"TEM - Meals/perdiem","TL","Travel",70,"Direct Expenditures","2TRAV","TEM Travel"]
[2504,"TEM - Rental Car","TL","Travel",70,"Direct Expenditures","2TRAV","TEM Travel"]
[2505,"TEM - Transportation - not airfare","TL","Travel",70,"Direct Expenditures","2TRAV","TEM Travel"]
[2506,"TEM - Local/mileage","TL","Travel",70,"Direct Expenditures","2TRAV","TEM Travel"]
[2507,"TEM - Miscellaneous","TL","Travel",70,"Direct Expenditures","2TRAV","TEM Travel"]
[3001,"Contractual Serv-Budget","SV","Contractual Services",70,"Direct Expenditures","3BUD","Budget"]
[3002,"Collection Agency Costs","SV","Contractual Services",70,"Direct Expenditures","3FEES","Fees And Professional Services"]
[3003,"Admn Support Services","SV","Contractual Services",70,"Direct Expenditures","3FEES","Fees And Professional Services"]
[3004,"Due Diligence Service Fee","SV","Contractual Services",70,"Direct Expenditures","3FEES","Fees And Professional Services"]
[3005,"Professional Service Othr","SV","Contractual Services",70,"Direct Expenditures","3FEES","Fees And Professional Services"]
[3007,"S/T Educ Services Fees","SV","Contractual Services",70,"Direct Expenditures","3FEES","Fees And Professional Services"]
[3008,"Catering Sp Events/Cerem","SV","Contractual Services",70,"Direct Expenditures","3FEES","Fees And Professional Services"]
[3010,"Ship Use Charge","SV","Contractual Services",70,"Direct Expenditures","3RESSC","Research Service Centers"]
[3011,"Consultant/Engineer Costs","SV","Contractual Services",70,"Direct Expenditures","3FEES","Fees And Professional Services"]
[3013,"Architect Expenditure","SV","Contractual Services",70,"Direct Expenditures","3FEES","Fees And Professional Services"]
[3014,"Participant Support","SV","Contractual Services",70,"Direct Expenditures","3FEES","Fees And Professional Services"]
[3015,"Bond Costs","SV","Contractual Services",70,"Direct Expenditures","3FEES","Fees And Professional Services"]
[3016,"Legal Fees","SV","Contractual Services",70,"Direct Expenditures","3FEES","Fees And Professional Services"]
[3017,"Honoraria","SV","Contractual Services",70,"Direct Expenditures","3FEES","Fees And Professional Services"]
[3018,"Matching/Restricted fund Catering","SV","Contractual Services",70,"Direct Expenditures","3FEES","Fees And Professional Services"]
[3019,"Foreign Wages & Salaries","SV","Contractual Services",70,"Direct Expenditures","3FEES","Fees And Professional Services"]
[3020,"Foreign P/R Taxes And Ben","SV","Contractual Services",70,"Direct Expenditures","3FEES","Fees And Professional Services"]
[3021,"Sub-Agrmnt(Recip) Under25","SV","Contractual Services",70,"Direct Expenditures","3FEES","Fees And Professional Services"]
[3022,"Sub-Agrmnt(Recip) Over25","SV","Contractual Services",70,"Direct Expenditures","3FEES","Fees And Professional Services"]
[3025,"Sub-Agrmnt(Other) Under25","SV","Contractual Services",70,"Direct Expenditures","3FEES","Fees And Professional Services"]
[3026,"Sub-Agrmnt(Other) Over25","SV","Contractual Services",70,"Direct Expenditures","3FEES","Fees And Professional Services"]
[3027,"EVOS Sub-agreement over $25,000","SV","Contractual Services",70,"Direct Expenditures","3FEES","Fees And Professional Services"]
[3028,"Apprvd Service Contract under $25K","SV","Contractual Services",70,"Direct Expenditures","3FEES","Fees And Professional Services"]
[3029,"Apprvd Service Contract over $25K","SV","Contractual Services",70,"Direct Expenditures","3FEES","Fees And Professional Services"]
[3031,"Research Subject Payments","SV","Contractual Services",70,"Direct Expenditures","3FEES","Fees And Professional Services"]
[3032,"Food Service/Vending provider","SV","Contractual Services",70,"Direct Expenditures","3FEES","Fees And Professional Services"]
[3038,"Catering For Fund Raisers","SV","Contractual Services",70,"Direct Expenditures","3FEES","Fees And Professional Services"]
[3040,"Lobbying Services","SV","Contractual Services",70,"Direct Expenditures","3FEES","Fees And Professional Services"]
[3051,"UACP Training Services","SV","Contractual Services",70,"Direct Expenditures","3OTCNS","Other Contractual Services"]
[3052,"Laboratory Testing","SV","Contractual Services",70,"Direct Expenditures","3TEST","Testing Services"]
[3059,"Testing Services-Other","SV","Contractual Services",70,"Direct Expenditures","3TEST","Testing Services"]
[3061,"FP&C Admin Expense Fund 5","SV","Contractual Services",70,"Direct Expenditures","3OTCNS","Other Contractual Services"]
[3062,"FP&C Admin Expense Funds 1,2","SV","Contractual Services",70,"Direct Expenditures","3OTCNS","Other Contractual Services"]
[3063,"FP&C Admin Expense Waived","SV","Contractual Services",70,"Direct Expenditures","3OTCNS","Other Contractual Services"]
[3064,"Laundry Services","SV","Contractual Services",70,"Direct Expenditures","3OTCNS","Other Contractual Services"]
[3081,"Res.Svc.Cnt-SFOS-Publctns","SV","Contractual Services",70,"Direct Expenditures","3RESSC","Research Service Centers"]
[3083,"Res.Svc.Cnt-SFOS-D/Proc","SV","Contractual Services",70,"Direct Expenditures","3RESSC","Research Service Centers"]
[3091,"Res.Svc.Cnt-GI-Electronic","SV","Contractual Services",70,"Direct Expenditures","3RESSC","Research Service Centers"]
[3092,"Res.Svc.Cnt-GI-Machine","SV","Contractual Services",70,"Direct Expenditures","3RESSC","Research Service Centers"]
[3093,"Res.Svc.Cnt-GI-Steno Pool","SV","Contractual Services",70,"Direct Expenditures","3RESSC","Research Service Centers"]
[3094,"Res.Svc.Cnt-GI-Computer","SV","Contractual Services",70,"Direct Expenditures","3RESSC","Research Service Centers"]
[3095,"Res Svc Cnt - GI Digital Design","SV","Contractual Services",70,"Direct Expenditures","3RESSC","Research Service Centers"]
[3100,"Services Budget Excluded A21","SV","Contractual Services",70,"Direct Expenditures","3BUD","Budget"]
[3111,"Office Equip Rent/Lease L/T","SV","Contractual Services",70,"Direct Expenditures","3RENT","Rental/Leases"]
[3112,"Car Aircraft Boat Rent S/T","SV","Contractual Services",70,"Direct Expenditures","3RENT","Rental/Leases"]
[3114,"Mnframe Computer Lease L/T","SV","Contractual Services",70,"Direct Expenditures","3RENT","Rental/Leases"]
[3115,"Facilities Rental L/T","SV","Contractual Services",70,"Direct Expenditures","3RENT","Rental/Leases"]
[3116,"Othr Equip Rental L/T","SV","Contractual Services",70,"Direct Expenditures","3RENT","Rental/Leases"]
[3117,"Othr Equip Rental S/T","SV","Contractual Services",70,"Direct Expenditures","3RENT","Rental/Leases"]
[3118,"Facilities Rental S/T","SV","Contractual Services",70,"Direct Expenditures","3RENT","Rental/Leases"]
[3119,"Personal Use-Auto/Other","SV","Contractual Services",70,"Direct Expenditures","3RENT","Rental/Leases"]
[3221,"Computer Services","SV","Contractual Services",70,"Direct Expenditures","3DP","Data Processing Charges"]
[3222,"Software License/Maint","SV","Contractual Services",70,"Direct Expenditures","3DP","Data Processing Charges"]
[3223,"UACN Network Connects","SV","Contractual Services",70,"Direct Expenditures","3DP","Data Processing Charges"]
[3331,"Duplicating Charges","SV","Contractual Services",70,"Direct Expenditures","3REP","Reproduction Charges"]
[3332,"Printing-Non Resale","SV","Contractual Services",70,"Direct Expenditures","3REP","Reproduction Charges"]
[3333,"Film Processing and Developing","SV","Contractual Services",70,"Direct Expenditures","3REP","Reproduction Charges"]
[3339,"Reproduction Costs-Other","SV","Contractual Services",70,"Direct Expenditures","3REP","Reproduction Charges"]
[3351,"Freight & Parcel Post","SV","Contractual Services",70,"Direct Expenditures","3FRGT","Shipping/Handling/Storage"]
[3355,"Demurrage/Storage","SV","Contractual Services",70,"Direct Expenditures","3FRGT","Shipping/Handling/Storage"]
[3358,"Moving-Office/Lab/Equip","SV","Contractual Services",70,"Direct Expenditures","3FRGT","Shipping/Handling/Storage"]
[3441,"Phone Rental Charges","SV","Contractual Services",70,"Direct Expenditures","3COMM","Communications Charges"]
[3442,"Toll Charges (Long Dist)","SV","Contractual Services",70,"Direct Expenditures","3COMM","Communications Charges"]
[3443,"Leased Lines","SV","Contractual Services",70,"Direct Expenditures","3COMM","Communications Charges"]
[3444,"Postage","SV","Contractual Services",70,"Direct Expenditures","3FRGT","Shipping/Handling/Storage"]
[3445,"Audio Conference Charges","SV","Contractual Services",70,"Direct Expenditures","3COMM","Communications Charges"]
[3446,"Cellular Phone Charges","SV","Contractual Services",70,"Direct Expenditures","3COMM","Communications Charges"]
[3447,"Mobile Device Allowance","SV","Contractual Services",70,"Direct Expenditures","3COMM","Communications Charges"]
[3448,"Prog/Proj Postage &Special Handling","SV","Contractual Services",70,"Direct Expenditures","3FRGT","Shipping/Handling/Storage"]
[3449,"Communication Charge-Othr","SV","Contractual Services",70,"Direct Expenditures","3COMM","Communications Charges"]
[3501,"Other Advert/Publicity","SV","Contractual Services",70,"Direct Expenditures","3PUB","Publicity And Advertising"]
[3505,"Raffle Prize Payments","SV","Contractual Services",70,"Direct Expenditures","3PUB","Publicity And Advertising"]
[3510,"Recruit & Procure Advert","SV","Contractual Services",70,"Direct Expenditures","3PUB","Publicity And Advertising"]
[3520,"Program Regd Advertising","SV","Contractual Services",70,"Direct Expenditures","3PUB","Publicity And Advertising"]
[3551,"Publicat Printing-Resale","SV","Contractual Services",70,"Direct Expenditures","3CNRES","Contractual Services - Resale"]
[3661,"Tuition Registration Fees","SV","Contractual Services",70,"Direct Expenditures","3DUE","Dues/Membership"]
[3662,"Per A-21 Allowable Dues/Memberships","SV","Contractual Services",70,"Direct Expenditures","3DUE","Dues/Membership"]
[3663,"Civic or Community Dues/Memberships","SV","Contractual Services",70,"Direct Expenditures","3DUE","Dues/Membership"]
[3771,"Repairs/Alteration Servic","SV","Contractual Services",70,"Direct Expenditures","3MAINT","Maintenance/Repairs/Alterations"]
[3772,"Veh, Plane, Boat Rpr/Main","SV","Contractual Services",70,"Direct Expenditures","3MAINT","Maintenance/Repairs/Alterations"]
[3774,"Equip Main Svc Contract","SV","Contractual Services",70,"Direct Expenditures","3MAINT","Maintenance/Repairs/Alterations"]
[3775,"Equipment Maintenance","SV","Contractual Services",70,"Direct Expenditures","3MAINT","Maintenance/Repairs/Alterations"]
[3781,"Facilities Repair/Maint","SV","Contractual Services",70,"Direct Expenditures","3MAINT","Maintenance/Repairs/Alterations"]
[3782,"Custodial/Janitorial Serv","SV","Contractual Services",70,"Direct Expenditures","3MAINT","Maintenance/Repairs/Alterations"]
[3799,"Maintenance/Security-Othr","SV","Contractual Services",70,"Direct Expenditures","3MAINT","Maintenance/Repairs/Alterations"]
[3881,"Sewer Utility","SV","Contractual Services",70,"Direct Expenditures","3UTIL","Utilities"]
[3882,"Electrical Utility","SV","Contractual Services",70,"Direct Expenditures","3UTIL","Utilities"]
[3883,"Water Utility","SV","Contractual Services",70,"Direct Expenditures","3UTIL","Utilities"]
[3884,"Heat Utility","SV","Contractual Services",70,"Direct Expenditures","3UTIL","Utilities"]
[3885,"Fuel Utility","SV","Contractual Services",70,"Direct Expenditures","3UTIL","Utilities"]
[3886,"Garbage Disposal","SV","Contractual Services",70,"Direct Expenditures","3UTIL","Utilities"]
[3887,"UAF Utilities Services","SV","Contractual Services",70,"Direct Expenditures","3UTIL","Utilities"]
[3888,"Non Home Port Services","SV","Contractual Services",70,"Direct Expenditures","3UTIL","Utilities"]
[3889,"Home Port Services","SV","Contractual Services",70,"Direct Expenditures","3UTIL","Utilities"]
[3898,"Utilities - Not Subject to F & A","SV","Contractual Services",70,"Direct Expenditures","3UTIL","Utilities"]
[3899,"Utilities-Other","SV","Contractual Services",70,"Direct Expenditures","3UTIL","Utilities"]
[3964,"Taxes & Licenses","SV","Contractual Services",70,"Direct Expenditures","3INSUR","Insurance/Taxes/Licenses/Etc"]
[3965,"Bank Charges","SV","Contractual Services",70,"Direct Expenditures","3INSUR","Insurance/Taxes/Licenses/Etc"]
[3966,"Cash Over & Short","SV","Contractual Services",70,"Direct Expenditures","3INSUR","Insurance/Taxes/Licenses/Etc"]
[3967,"Fines & Penalties","SV","Contractual Services",70,"Direct Expenditures","3INSUR","Insurance/Taxes/Licenses/Etc"]
[3970,"Property Insurance Prem","SV","Contractual Services",70,"Direct Expenditures","3INSUR","Insurance/Taxes/Licenses/Etc"]
[3971,"Liability Insurance Prem","SV","Contractual Services",70,"Direct Expenditures","3INSUR","Insurance/Taxes/Licenses/Etc"]
[3972,"Aviation Insurance Prem","SV","Contractual Services",70,"Direct Expenditures","3INSUR","Insurance/Taxes/Licenses/Etc"]
[3973,"Marine Insurance Premium","SV","Contractual Services",70,"Direct Expenditures","3INSUR","Insurance/Taxes/Licenses/Etc"]
[3974,"Med Malpractice Ins Prem","SV","Contractual Services",70,"Direct Expenditures","3INSUR","Insurance/Taxes/Licenses/Etc"]
[3975,"Other Insurance Premium","SV","Contractual Services",70,"Direct Expenditures","3INSUR","Insurance/Taxes/Licenses/Etc"]
[3978,"Self Ins IBNR Reserve Exp","SV","Contractual Services",70,"Direct Expenditures","3INSUR","Insurance/Taxes/Licenses/Etc"]
[3979,"Marine P & I Claims","SV","Contractual Services",70,"Direct Expenditures","3INSUR","Insurance/Taxes/Licenses/Etc"]
[3980,"Marine Hull Claims","SV","Contractual Services",70,"Direct Expenditures","3INSUR","Insurance/Taxes/Licenses/Etc"]
[3981,"Property Claims Self-Ins","SV","Contractual Services",70,"Direct Expenditures","3INSUR","Insurance/Taxes/Licenses/Etc"]
[3982,"Auto Liab Claims Self-Ins","SV","Contractual Services",70,"Direct Expenditures","3INSUR","Insurance/Taxes/Licenses/Etc"]
[3983,"Work Comp Claim-Time Loss","SV","Contractual Services",70,"Direct Expenditures","3INSUR","Insurance/Taxes/Licenses/Etc"]
[3984,"Work Comp Claims-Medical","SV","Contractual Services",70,"Direct Expenditures","3INSUR","Insurance/Taxes/Licenses/Etc"]
[3985,"Gen Liab Claims-Self Ins","SV","Contractual Services",70,"Direct Expenditures","3INSUR","Insurance/Taxes/Licenses/Etc"]
[3986,"Other Liab Claim Self Ins","SV","Contractual Services",70,"Direct Expenditures","3INSUR","Insurance/Taxes/Licenses/Etc"]
[3987,"Auto Damage Claim Self In","SV","Contractual Services",70,"Direct Expenditures","3INSUR","Insurance/Taxes/Licenses/Etc"]
[3988,"Athletics Injury Claims","SV","Contractual Services",70,"Direct Expenditures","3INSUR","Insurance/Taxes/Licenses/Etc"]
[3989,"Other Claims/Self-Insured","SV","Contractual Services",70,"Direct Expenditures","3INSUR","Insurance/Taxes/Licenses/Etc"]
[3991,"Other Contractual Serv","SV","Contractual Services",70,"Direct Expenditures","3OTCNS","Other Contractual Services"]
[3993,"Game Guarantee","SV","Contractual Services",70,"Direct Expenditures","3OTCNS","Other Contractual Services"]
[3999,"Reclass entry offset - SW use only","SV","Contractual Services",70,"Direct Expenditures","3OTCNS","Other Contractual Services"]
[4001,"Commodities Budget","CM","Commodities",70,"Direct Expenditures","4BUD","Budget"]
[4008,"Food/Decor For Spec Event","CM","Commodities",70,"Direct Expenditures","4SUPP","Supplies"]
[4010,"Stationery/Office Supplies","CM","Commodities",70,"Direct Expenditures","4SUPP","Supplies"]
[4011,"Teaching Supplies","CM","Commodities",70,"Direct Expenditures","4SUPP","Supplies"]
[4012,"Prof-Tech-Scientific Sply","CM","Commodities",70,"Direct Expenditures","4SUPP","Supplies"]
[4013,"Medical & Safety Supplies","CM","Commodities",70,"Direct Expenditures","4SUPP","Supplies"]
[4014,"Computer Supplies","CM","Commodities",70,"Direct Expenditures","4SUPP","Supplies"]
[4015,"Program/Project Supplies","CM","Commodities",70,"Direct Expenditures","4SUPP","Supplies"]
[4016,"Taggable Project Supplies","CM","Commodities",70,"Direct Expenditures","4SUPP","Supplies"]
[4018,"Match/Restricted fund Self-Catered","CM","Commodities",70,"Direct Expenditures","4SUPP","Supplies"]
[4020,"Animals For Research","CM","Commodities",70,"Direct Expenditures","4SUPP","Supplies"]
[4021,"Food For Animals","CM","Commodities",70,"Direct Expenditures","4SUPP","Supplies"]
[4028,"Apprvd Commodity Contract under$25K","CM","Commodities",70,"Direct Expenditures","4SUPP","Supplies"]
[4029,"Apprvd Commodity Contract over $25K","CM","Commodities",70,"Direct Expenditures","4SUPP","Supplies"]
[4038,"Food/Decor-Fund Rasiers","CM","Commodities",70,"Direct Expenditures","4SUPP","Supplies"]
[4075,"Field Camp Supplies","CM","Commodities",70,"Direct Expenditures","4SUPP","Supplies"]
[4076,"Ship Supplies","CM","Commodities",70,"Direct Expenditures","4SUPP","Supplies"]
[4077,"Clothing & Uniforms","CM","Commodities",70,"Direct Expenditures","4SUPP","Supplies"]
[4078,"Food for Field Camp or Ship","CM","Commodities",70,"Direct Expenditures","4SUPP","Supplies"]
[4082,"Res. Svc. Center - Stockroom","CM","Commodities",70,"Direct Expenditures","4SUPP","Supplies"]
[4099,"Equip.Supplies-Threshold Transition","CM","Commodities",70,"Direct Expenditures","4SUPP","Supplies"]
[4111,"Veh, Aviation, Boat Fuel","CM","Commodities",70,"Direct Expenditures","4MAINT","Maintenance/Repairs Commodites"]
[4112,"Veh,Avia,Boat Pts,Sup&Acc","CM","Commodities",70,"Direct Expenditures","4MAINT","Maintenance/Repairs Commodites"]
[4113,"Vehicle, Aviation, Boat Lubricants","CM","Commodities",70,"Direct Expenditures","4MAINT","Maintenance/Repairs Commodites"]
[4151,"Maint Materials/Supplies","CM","Commodities",70,"Direct Expenditures","4MAINT","Maintenance/Repairs Commodites"]
[4152,"Cust Janit Mat & Supplies","CM","Commodities",70,"Direct Expenditures","4MAINT","Maintenance/Repairs Commodites"]
[4221,"Printed Subscriptions","CM","Commodities",70,"Direct Expenditures","4OTCOM","Other Commodities"]
[4222,"Electronic Subscriptions","CM","Commodities",70,"Direct Expenditures","4OTCOM","Other Commodities"]
[4325,"Utility Supplies","CM","Commodities",70,"Direct Expenditures","4OTCOM","Other Commodities"]
[4335,"Warehouse Material Issue","CM","Commodities",70,"Direct Expenditures","4OTCOM","Other Commodities"]
[4336,"Purchased-Undelivered","CM","Commodities",70,"Direct Expenditures","4OTCOM","Other Commodities"]
[4441,"Other Supplies/Commoditie","CM","Commodities",70,"Direct Expenditures","4OTCOM","Other Commodities"]
[4451,"Disposable Equip Purchase","CM","Commodities",70,"Direct Expenditures","4OTCOM","Other Commodities"]
[4455,"Hazardous Materials","CM","Commodities",70,"Direct Expenditures","4OTCOM","Other Commodities"]
[4456,"Haz Materials-UAF Remote","CM","Commodities",70,"Direct Expenditures","4OTCOM","Other Commodities"]
[4501,"Budget-Items For Resale","RS","Items for Resale",70,"Direct Expenditures","45BUD","Budget"]
[4510,"C.Of.G.S. Contra","RS","Items for Resale",70,"Direct Expenditures","4RSALE","Items For Resale"]
[4551,"Textbooks For Resale","RS","Items for Resale",70,"Direct Expenditures","4RSALE","Items For Resale"]
[4552,"Paperbacks For Resale","RS","Items for Resale",70,"Direct Expenditures","4RSALE","Items For Resale"]
[4553,"Tradebooks For Resale","RS","Items for Resale",70,"Direct Expenditures","4RSALE","Items For Resale"]
[4554,"Graduation Supplies/Items","RS","Items for Resale",70,"Direct Expenditures","4RSALE","Items For Resale"]
[4555,"Digital Textbooks for Resale","RS","Items for Resale",70,"Direct Expenditures","4RSALE","Items For Resale"]
[4556,"New Textbooks for Rent","RS","Items for Resale",70,"Direct Expenditures","4RSALE","Items For Resale"]
[4557,"Used textbooks for rent","RS","Items for Resale",70,"Direct Expenditures","4RSALE","Items For Resale"]
[4661,"Newspaper Periodical-Resale","RS","Items for Resale",70,"Direct Expenditures","4RSALE","Items For Resale"]
[4662,"Supplies For Resale","RS","Items for Resale",70,"Direct Expenditures","4RSALE","Items For Resale"]
[4663,"Sundry Items For Resale","RS","Items for Resale",70,"Direct Expenditures","4RSALE","Items For Resale"]
[4664,"Equipment For Resale","RS","Items for Resale",70,"Direct Expenditures","4RSALE","Items For Resale"]
[4665,"Electronics for Resale","RS","Items for Resale",70,"Direct Expenditures","4RSALE","Items For Resale"]
[4666,"Clothing For Resale","RS","Items for Resale",70,"Direct Expenditures","4RSALE","Items For Resale"]
[4667,"Insignia for Resale","RS","Items for Resale",70,"Direct Expenditures","4RSALE","Items For Resale"]
[4668,"Software/Peripherals for Resale","RS","Items for Resale",70,"Direct Expenditures","4RSALE","Items For Resale"]
[4669,"Other Items For Resale","RS","Items for Resale",70,"Direct Expenditures","4RSALE","Items For Resale"]
[4670,"Gift Items For Resale","RS","Items for Resale",70,"Direct Expenditures","4RSALE","Items For Resale"]
[4671,"Tools & Parts For Resale","RS","Items for Resale",70,"Direct Expenditures","4RSALE","Items For Resale"]
[4771,"Raw Food For Resale","RS","Items for Resale",70,"Direct Expenditures","4RSALE","Items For Resale"]
[5001,"Capital Expend Budget","CP","Capital Expenditures",70,"Direct Expenditures","5BUD","Budget"]
[5002,"Reserved Const Budget","CP","Capital Expenditures",70,"Direct Expenditures","5BUD","Budget"]
[5010,"Land","CP","Capital Expenditures",70,"Direct Expenditures","5LAND","Land"]
[5111,"Building","CP","Capital Expenditures",70,"Direct Expenditures","5BUILD","Buildings"]
[5113,"Building Repairs & Alter","CP","Capital Expenditures",70,"Direct Expenditures","5BUILD","Buildings"]
[5115,"Leasehold Improvmnt Costs","CP","Capital Expenditures",70,"Direct Expenditures","5BUILD","Buildings"]
[5117,"Other Capitalizable Assets","CP","Capital Expenditures",70,"Direct Expenditures","5BUILD","Buildings"]
[5118,"Intangible Assets","CP","Capital Expenditures",70,"Direct Expenditures","5INTAN","Intangible Assets"]
[5221,"Furniture & Furnishings","CP","Capital Expenditures",70,"Direct Expenditures","5EQUIP","Equipment"]
[5225,"Art - Tagged","CP","Capital Expenditures",70,"Direct Expenditures","5EQUIP","Equipment"]
[5229,"Medical, Safety & Fire Equipment","CP","Capital Expenditures",70,"Direct Expenditures","5EQUIP","Equipment"]
[5310,"Livestock","CP","Capital Expenditures",70,"Direct Expenditures","5EQUIP","Equipment"]
[5327,"Capitalizable Data Sets & Software","CP","Capital Expenditures",70,"Direct Expenditures","5INTAN","Intangible Assets"]
[5328,"Computer Equipment","CP","Capital Expenditures",70,"Direct Expenditures","5EQUIP","Equipment"]
[5329,"Mainframe Computers","CP","Capital Expenditures",70,"Direct Expenditures","5EQUIP","Equipment"]
[5330,"Telecommunication Equipment","CP","Capital Expenditures",70,"Direct Expenditures","5EQUIP","Equipment"]
[5331,"Educational Equipment","CP","Capital Expenditures",70,"Direct Expenditures","5EQUIP","Equipment"]
[5332,"Research Equipment","CP","Capital Expenditures",70,"Direct Expenditures","5EQUIP","Equipment"]
[5333,"Security Weapons","CP","Capital Expenditures",70,"Direct Expenditures","5EQUIP","Equipment"]
[5334,"Transportation Equipment","CP","Capital Expenditures",70,"Direct Expenditures","5EQUIP","Equipment"]
[5335,"Phy Plant Machines & Tool","CP","Capital Expenditures",70,"Direct Expenditures","5EQUIP","Equipment"]
[5336,"Office Equipment","CP","Capital Expenditures",70,"Direct Expenditures","5EQUIP","Equipment"]
[5337,"Farm Equipment","CP","Capital Expenditures",70,"Direct Expenditures","5EQUIP","Equipment"]
[5339,"Broadcasting Equip-TV/Radio","CP","Capital Expenditures",70,"Direct Expenditures","5EQUIP","Equipment"]
[5342,"Fixed Equipment","CP","Capital Expenditures",70,"Direct Expenditures","5EQUIP","Equipment"]
[5441,"Library Books","CP","Capital Expenditures",70,"Direct Expenditures","5LBRY","Library Bks & Media Material"]
[5442,"Library-Binding-Catalog","CP","Capital Expenditures",70,"Direct Expenditures","5LBRY","Library Bks & Media Material"]
[5443,"Library Films","CP","Capital Expenditures",70,"Direct Expenditures","5LBRY","Library Bks & Media Material"]
[5444,"Library Electronic Resources","CP","Capital Expenditures",70,"Direct Expenditures","5LBRY","Library Bks & Media Material"]
[5445,"Library Microfilm & Fiche","CP","Capital Expenditures",70,"Direct Expenditures","5LBRY","Library Bks & Media Material"]
[5552,"Museum Collections","CP","Capital Expenditures",70,"Direct Expenditures","5ART","Artifacts & Art"]
[5553,"Art - Nontagged","CP","Capital Expenditures",70,"Direct Expenditures","5ART","Artifacts & Art"]
[5554,"1% For Art-Under $5000","CP","Capital Expenditures",70,"Direct Expenditures","5ART","Artifacts & Art"]
[5666,"Infrastructure","CP","Capital Expenditures",70,"Direct Expenditures","5INFRA","Infrastructure"]
[5990,"Capital Equip Const Costs","CP","Capital Expenditures",70,"Direct Expenditures","5CIP","Construction In Progress"]
[6001,"Student Aid Budget","AD","Student Aid",70,"Direct Expenditures","6BUD","Budget"]
[6105,"Scholarships","AD","Student Aid",70,"Direct Expenditures","6SCHL","Scholarships"]
[6110,"Talent Grant Waivers","AD","Student Aid",70,"Direct Expenditures","6WAIV","Waivers"]
[6112,"Health, Wellness & Develop Waiver","AD","Student Aid",70,"Direct Expenditures","6WAIV","Waivers"]
[6113,"Needs - Based Waivers","AD","Student Aid",70,"Direct Expenditures","6WAIV","Waivers"]
[6115,"Senior Citizen Fee Waiver","AD","Student Aid",70,"Direct Expenditures","6WAIV","Waivers"]
[6118,"Military Memorial Waiver","AD","Student Aid",70,"Direct Expenditures","6WAIV","Waivers"]
[6120,"Add'l Tuition Mitigation","AD","Student Aid",70,"Direct Expenditures","6OTHSA","Other Student Aid"]
[6210,"Grad Assistantship Waiver","AD","Student Aid",70,"Direct Expenditures","6WAIV","Waivers"]
[6211,"Undergraduate Assistantship Waivers","AD","Student Aid",70,"Direct Expenditures","6WAIV","Waivers"]
[6221,"Fellowships","AD","Student Aid",70,"Direct Expenditures","6FLLW","Fellowships"]
[6331,"Other Student Aid","AD","Student Aid",70,"Direct Expenditures","6OTHSA","Other Student Aid"]
[6341,"Stdnt Loan Cancl Expense","AD","Student Aid",70,"Direct Expenditures","6OTHSA","Other Student Aid"]
[6351,"NDSL Assignment Expense","AD","Student Aid",70,"Direct Expenditures","6OTHSA","Other Student Aid"]
[6352,"Nursing Loan Writeoff Exp","AD","Student Aid",70,"Direct Expenditures","6OTHSA","Other Student Aid"]
[6361,"Student Aid Award Refunds","AD","Student Aid",70,"Direct Expenditures","6OTHSA","Other Student Aid"]
[6441,"Matching Funds-Studentaid","AD","Student Aid",70,"Direct Expenditures","6OTHSA","Other Student Aid"]
[6450,"Tuition Allowance - Contra Expense","AD","Student Aid",70,"Direct Expenditures","6OTHSA","Other Student Aid"]
[7001,"IC Recovery Budget Only","IC","F & A Cost",70,"Direct Expenditures","7BUD","Budget"]
[7811,"Indirect Costs","IC","F & A Cost",70,"Direct Expenditures","7FUND2","Indirect Costs"]
[8001,"Miscellaneous Expenditure","MS","Miscellaneous Expenses",70,"Direct Expenditures","8BUD","Budget"]
[8002,"Undistrib Const Budget","MS","Miscellaneous Expenses",70,"Direct Expenditures","8BUD","Budget"]
[8003,"Budget Assumptions","MS","Miscellaneous Expenses",70,"Direct Expenditures","8BUD","Budget"]
[8115,"Entertainment","MS","Miscellaneous Expenses",70,"Direct Expenditures","8OTMIS","Other Miscellanous"]
[8210,"Prizes/Awards Non-Employee","MS","Miscellaneous Expenses",70,"Direct Expenditures","8OTMIS","Other Miscellanous"]
[8235,"Bad Debts","MS","Miscellaneous Expenses",70,"Direct Expenditures","8OTMIS","Other Miscellanous"]
[8236,"SW Check Reissue","MS","Miscellaneous Expenses",70,"Direct Expenditures","8OTMIS","Other Miscellanous"]
[8340,"Interest/Fees-Late Paymnt","MS","Miscellaneous Expenses",70,"Direct Expenditures","8OTMIS","Other Miscellanous"]
[8341,"Interest On Debt","MS","Miscellaneous Expenses",70,"Direct Expenditures","8OTMIS","Other Miscellanous"]
[8342,"Retirement Of Indebtdness","MS","Miscellaneous Expenses",70,"Direct Expenditures","8OTMIS","Other Miscellanous"]
[8343,"Offset to Net Pension Obligation","MS","Miscellaneous Expenses",70,"Direct Expenditures","8OTMIS","Other Miscellanous"]
[8344,"Increase in Net Indebtedness","MS","Miscellaneous Expenses",70,"Direct Expenditures","8OTMIS","Other Miscellanous"]
[8345,"Inter-university interest expense","MS","Miscellaneous Expenses",70,"Direct Expenditures","8OTMIS","Other Miscellanous"]
[8451,"Mandatory Transfers - Debt Service","MT","Mandatory Transfers",80,"Transfers","MNTRF","Mandatory Transfers"]
[8452,"Mandatory Transfers - Other","MT","Mandatory Transfers",80,"Transfers","MNTRF","Mandatory Transfers"]
[8453,"Transfers Other","NT","Non-Mandatory Transfers",80,"Transfers","NMNTRF","Non-Mandatory Transfers"]
[8455,"Funding Rollover","NT","Non-Mandatory Transfers",80,"Transfers","NMNTRF","Non-Mandatory Transfers"]
[8456,"Transfer Fixed Price Residual","NT","Non-Mandatory Transfers",80,"Transfers","NMNTRF","Non-Mandatory Transfers"]
[8457,"Recharge Center Subsidy","NT","Non-Mandatory Transfers",80,"Transfers","NMNTRF","Non-Mandatory Transfers"]
[8458,"F & A Recovery Waived","NT","Non-Mandatory Transfers",80,"Transfers","NMNTRF","Non-Mandatory Transfers"]
[8459,"Statewide Transfer","NT","Non-Mandatory Transfers",80,"Transfers","NMNTRF","Non-Mandatory Transfers"]
[8501,"Disbursment of Foundation","MS","Miscellaneous Expenses",70,"Direct Expenditures","8TRNSF","Disbursements \"to\""]
[8502,"Disbursements to Agency Funds","MS","Miscellaneous Expenses",70,"Direct Expenditures","8TRNSF","Disbursements \"to\""]
[8505,"Agency Disbursements to UA","MS","Miscellaneous Expenses",70,"Direct Expenditures","8TRNSF","Disbursements \"to\""]
[8550,"Other Interdeparmental Expenses","MS","Miscellaneous Expenses",70,"Direct Expenditures","8OTMIS","Other Miscellanous"]
[8581,"Capital Project Funding","MS","Miscellaneous Expenses",70,"Direct Expenditures","8OTMIS","Other Miscellanous"]
[8651,"Rstr Fnd Disallowed Costs","MS","Miscellaneous Expenses",70,"Direct Expenditures","8MSRST","Miscellanous Restricted Activity"]
[8661,"Cost Overrun Restr Fnds","MS","Miscellaneous Expenses",70,"Direct Expenditures","8MSRST","Miscellanous Restricted Activity"]
[8665,"Capitalized Lm Expenses","MS","Miscellaneous Expenses",70,"Direct Expenditures","8OTMIS","Other Miscellanous"]
[8710,"ACT Valuation Exp/Rev","MS","Miscellaneous Expenses",70,"Direct Expenditures","8OTMIS","Other Miscellanous"]
[8711,"ACT Cash-Tuition Value Variance","MS","Miscellaneous Expenses",70,"Direct Expenditures","8OTMIS","Other Miscellanous"]
[8804,"Depreciation Expense","MS","Miscellaneous Expenses",70,"Direct Expenditures","8OTMIS","Other Miscellanous"]
[8805,"Depreciation Expense-Svc/Rechg Ctrs","MS","Miscellaneous Expenses",70,"Direct Expenditures","8OTMIS","Other Miscellanous"]
[8807,"Gain/Loss on Equip Disp-Rechg Ctrs","MS","Miscellaneous Expenses",70,"Direct Expenditures","8OTMIS","Other Miscellanous"]
[8808,"Disposal of Plant Assets","MS","Miscellaneous Expenses",70,"Direct Expenditures","8OTMIS","Other Miscellanous"]
[8992,"Restricted Matching Exp","MS","Miscellaneous Expenses",70,"Direct Expenditures","8MSRST","Miscellanous Restricted Activity"]
[8993,"Restr Fnd Match -IC","MS","Miscellaneous Expenses",70,"Direct Expenditures","8MSRST","Miscellanous Restricted Activity"]
[9101,"Undergrad Consolidated Tuition","SF","Student Fees",50,"Revenue","9TUIT","Tuition"]
[9102,"Undergrad/Credit Hr Tuition","SF","Student Fees",50,"Revenue","9TUIT","Tuition"]
[9104,"Grad/Credit Hr Tuition","SF","Student Fees",50,"Revenue","9TUIT","Tuition"]
[9106,"Lower Division Tuition","SF","Student Fees",50,"Revenue","9TUIT","Tuition"]
[9107,"Upper Division Tuition","SF","Student Fees",50,"Revenue","9TUIT","Tuition"]
[9108,"Non Resident Surcharge","SF","Student Fees",50,"Revenue","9TUIT","Tuition"]
[9109,"Upper Div Non-Res Surcharge","SF","Student Fees",50,"Revenue","9TUIT","Tuition"]
[9110,"Graduate Non-Res Surcharge","SF","Student Fees",50,"Revenue","9TUIT","Tuition"]
[9111,"UALC Intercampus Tuition","SF","Student Fees",50,"Revenue","9TUIT","Tuition"]
[9120,"Tuition Mitigation","SF","Student Fees",50,"Revenue","9TUIT","Tuition"]
[9130,"Tuition Allowance - Contra Revenue","SF","Student Fees",50,"Revenue","9TUIT","Tuition"]
[9140,"Tuition Discounts - Contra Revenue","SF","Student Fees",50,"Revenue","9TUIT","Tuition"]
[9150,"Transcript Fees","SF","Student Fees",50,"Revenue","9FEES","Student Fees"]
[9151,"Noncredit&Spec Course Fee","SF","Student Fees",50,"Revenue","9FEES","Student Fees"]
[9152,"Application/Admission Fee","SF","Student Fees",50,"Revenue","9FEES","Student Fees"]
[9153,"Drop/Add Fees","SF","Student Fees",50,"Revenue","9FEES","Student Fees"]
[9154,"Late Registration","SF","Student Fees",50,"Revenue","9FEES","Student Fees"]
[9155,"Health Insurance/Servc","SF","Student Fees",50,"Revenue","9FEES","Student Fees"]
[9156,"Graduation Fee","SF","Student Fees",50,"Revenue","9FEES","Student Fees"]
[9157,"Deferred Payment Fee","SF","Student Fees",50,"Revenue","9FEES","Student Fees"]
[9158,"Student Activity Fee","SF","Student Fees",50,"Revenue","9FEES","Student Fees"]
[9159,"Lab/Materials Fees","SF","Student Fees",50,"Revenue","9FEES","Student Fees"]
[9160,"Course Reservation Fee","SF","Student Fees",50,"Revenue","9FEES","Student Fees"]
[9161,"Computer laboratory Fees","SF","Student Fees",50,"Revenue","9FEES","Student Fees"]
[9162,"2 percent Network Charge","SF","Student Fees",50,"Revenue","9FEES","Student Fees"]
[9163,"Professional Dev Courses - 500 leve","SF","Student Fees",50,"Revenue","9FEES","Student Fees"]
[9164,"Tuition Surcharge","SF","Student Fees",50,"Revenue","9FEES","Student Fees"]
[9210,"State Appropriation","GA","Government Appropriations",50,"Revenue","9APGEN","State Appropriation General"]
[9211,"State Apr - ACPE Dividend","GA","Government Appropriations",50,"Revenue","9APGEN","State Appropriation General"]
[9212,"State Apr-Tech Voc Educ Prog Other","GA","Government Appropriations",50,"Revenue","9APGEN","State Appropriation General"]
[9222,"State Matching Fund Appr","GA","Government Appropriations",50,"Revenue","9APGEN","State Appropriation General"]
[9223,"State Approp GF/Mntl Trst","GA","Government Appropriations",50,"Revenue","9APGEN","State Appropriation General"]
[9224,"State Apr-Mental Hlth Trust Recpts","GA","Government Appropriations",50,"Revenue","9APGEN","State Appropriation General"]
[9225,"State Approp-G.O. Bonds","GA","Government Appropriations",50,"Revenue","9APGEN","State Appropriation General"]
[9226,"State Approp-Capital","GA","Government Appropriations",50,"Revenue","9APGEN","State Appropriation General"]
[9227,"State Apr-Alaska Hsg Capital Corp.","GA","Government Appropriations",50,"Revenue","9APGEN","State Appropriation General"]
[9228,"StateApr-AIDEA Dividend","GA","Government Appropriations",50,"Revenue","9APGEN","State Appropriation General"]
[9229,"State Appropriation Lapse","GA","Government Appropriations",50,"Revenue","9APGEN","State Appropriation General"]
[9231,"State Apr - AK Science & Tech","GA","Government Appropriations",50,"Revenue","9APNGN","State Appropr-Non-General"]
[9232,"State Apr - AK Indust Dev & Export","GA","Government Appropriations",50,"Revenue","9APNGN","State Appropr-Non-General"]
[9233,"State Apr-AK Sci & Tech Endowment","GA","Government Appropriations",50,"Revenue","9APNGN","State Appropr-Non-General"]
[9240,"State Apr-State Emplymt & Trng Prog","GA","Government Appropriations",50,"Revenue","9APGEN","State Appropriation General"]
[9241,"State Apr-License Plate Revenue","GA","Government Appropriations",50,"Revenue","9APGEN","State Appropriation General"]
[9242,"State Apr - Small Business Dev Ctr","GA","Government Appropriations",50,"Revenue","9APGEN","State Appropriation General"]
[9250,"Federal Appropriations","GA","Government Appropriations",50,"Revenue","9APFED","Federal Appropriations"]
[9275,"City/Borough Appr","GA","Government Appropriations",50,"Revenue","9APCTY","City/Borough Appr"]
[9330,"State Grants/Contracts","SP","Sponsor Programs",50,"Revenue","9STGC","State Grants/Contr"]
[9331,"State Capital RSA's - CIP Receipts","SP","Sponsor Programs",50,"Revenue","9STGC","State Grants/Contr"]
[9332,"State - ARRA Stimulus Pass-thru","SP","Sponsor Programs",50,"Revenue","9STGC","State Grants/Contr"]
[9333,"State On Behalf Payments","SP","Sponsor Programs",50,"Revenue","9STGC","State Grants/Contr"]
[9334,"State G&C-Federal Pass Though","SP","Sponsor Programs",50,"Revenue","9STGC","State Grants/Contr"]
[9355,"Federal Grant & Contracts Rev","SP","Sponsor Programs",50,"Revenue","9FEDGC","Federal Grants/Contracts"]
[9356,"ARRA Stimulus Funding","SP","Sponsor Programs",50,"Revenue","9FEDGC","Federal Grants/Contracts"]
[9358,"Federal Stdnt Loan Reimb.","SP","Sponsor Programs",50,"Revenue","9FEDGC","Federal Grants/Contracts"]
[9377,"City/Boro Grants/Contract","SP","Sponsor Programs",50,"Revenue","9CTYGC","City/Boro Grants/Contract"]
[9391,"RELL Rev-SW user only reclass","SP","Sponsor Programs",50,"Revenue","9FEDGC","Federal Grants/Contracts"]
[9392,"Fed Cap Rev - SW only Reclass","SP","Sponsor Programs",50,"Revenue","9FEDGC","Federal Grants/Contracts"]
[9394,"State Cap Rev - SW use only-Reclass","SP","Sponsor Programs",50,"Revenue","9STGC","State Grants/Contr"]
[9410,"Corporate Grants and Contracts","RP","Other Revenue Sources - Private",50,"Revenue","9PRGC","Private Grants / Contracts"]
[9420,"Oil Grants and Contracts","RP","Other Revenue Sources - Private",50,"Revenue","9PRGC","Private Grants / Contracts"]
[9425,"UA Foundation Grants and Contracts","RP","Other Revenue Sources - Private",50,"Revenue","9PRGC","Private Grants / Contracts"]
[9427,"Other Foundations Grants/Contracts","RP","Other Revenue Sources - Private",50,"Revenue","9PRGC","Private Grants / Contracts"]
[9430,"Institute Grants and Contracts","RP","Other Revenue Sources - Private",50,"Revenue","9PRGC","Private Grants / Contracts"]
[9435,"Alumni Grants and Contracts","RP","Other Revenue Sources - Private",50,"Revenue","9PRGC","Private Grants / Contracts"]
[9440,"Individual Grants and Contracts","RP","Other Revenue Sources - Private",50,"Revenue","9PRGC","Private Grants / Contracts"]
[9445,"Alaska Native Grants and Contracts","RP","Other Revenue Sources - Private",50,"Revenue","9PRGC","Private Grants / Contracts"]
[9450,"Svc Clb/Non-Prof GrantsandContracts","RP","Other Revenue Sources - Private",50,"Revenue","9PRGC","Private Grants / Contracts"]
[9455,"Agency Fund Grants and Contracts","RP","Other Revenue Sources - Private",50,"Revenue","9PRGC","Private Grants / Contracts"]
[9460,"Other Private Grants and Contracts","RP","Other Revenue Sources - Private",50,"Revenue","9PRGC","Private Grants / Contracts"]
[9470,"Other Univ Grants and Contracts","RP","Other Revenue Sources - Private",50,"Revenue","9PRGC","Private Grants / Contracts"]
[9475,"Foreign Govt Grants and Contracts","RP","Other Revenue Sources - Private",50,"Revenue","9PRGC","Private Grants / Contracts"]
[9478,"Private Gifts - Cash","RP","Other Revenue Sources - Private",50,"Revenue","9GIFTS","Private Gifts"]
[9480,"Private Gifts - Noncash","RP","Other Revenue Sources - Private",50,"Revenue","9GIFTS","Private Gifts"]
[9485,"Third Party In-Kind Contributions","RP","Other Revenue Sources - Private",50,"Revenue","9GIFTS","Private Gifts"]
[9490,"ARRA Stimulus Grants & Contracts","RP","Other Revenue Sources - Private",50,"Revenue","9PRGC","Private Grants / Contracts"]
[9499,"Private Cap Rev-SW use only-Reclass","RP","Other Revenue Sources - Private",50,"Revenue","9PRGC","Private Grants / Contracts"]
[9520,"Allocated Endowment","EN","Donations & Endowment Income",50,"Revenue","9ENDW","Endowment Revenue"]
[9525,"Endow Real Estate Rental","EN","Donations & Endowment Income",50,"Revenue","9ENDW","Endowment Revenue"]
[9530,"Endowment Investment Rev","EN","Donations & Endowment Income",50,"Revenue","9ENDW","Endowment Revenue"]
[9531,"Endowment Investment Fees","EN","Donations & Endowment Income",50,"Revenue","9ENDW","Endowment Revenue"]
[9535,"Miscell Endowment Revenue","EN","Donations & Endowment Income",50,"Revenue","9ENDW","Endowment Revenue"]
[9540,"Gain/Losses On Endow Inv","EN","Donations & Endowment Income",50,"Revenue","9ENDW","Endowment Revenue"]
[9541,"Unrealized Gains & Losses on Invest","EN","Donations & Endowment Income",50,"Revenue","9ENDW","Endowment Revenue"]
[9545,"Endowment Net Revenue","EN","Donations & Endowment Income",50,"Revenue","9ENDW","Endowment Revenue"]
[9550,"Endowment Permits and Fees","EN","Donations & Endowment Income",50,"Revenue","9ENDW","Endowment Revenue"]
[9552,"Endowment Land Sales","EN","Donations & Endowment Income",50,"Revenue","9ENDW","Endowment Revenue"]
[9554,"Endowment Mineral Leases","EN","Donations & Endowment Income",50,"Revenue","9ENDW","Endowment Revenue"]
[9556,"Endowment Mineral Royalties","EN","Donations & Endowment Income",50,"Revenue","9ENDW","Endowment Revenue"]
[9558,"Endowment Land Leases","EN","Donations & Endowment Income",50,"Revenue","9ENDW","Endowment Revenue"]
[9560,"Endowment Gas and Oil Leases","EN","Donations & Endowment Income",50,"Revenue","9ENDW","Endowment Revenue"]
[9562,"Endowment Gas and Oil Royalties","EN","Donations & Endowment Income",50,"Revenue","9ENDW","Endowment Revenue"]
[9564,"Endowment Timber Sales","EN","Donations & Endowment Income",50,"Revenue","9ENDW","Endowment Revenue"]
[9566,"Endowment Gravel Sales","EN","Donations & Endowment Income",50,"Revenue","9ENDW","Endowment Revenue"]
[9568,"Endowment Easements and Rights of W","EN","Donations & Endowment Income",50,"Revenue","9ENDW","Endowment Revenue"]
[9599,"End Real Estate Rental to UA Depts","EN","Donations & Endowment Income",50,"Revenue","9ENDW","Endowment Revenue"]
[9602,"Educational Testing Fees","ED","Sales & Services of Education Dept.",50,"Revenue","9SALE","Sales & Serv-Educ Activit"]
[9603,"Lab Testing Fees","ED","Sales & Services of Education Dept.",50,"Revenue","9SALE","Sales & Serv-Educ Activit"]
[9604,"Soil Testing Fees","ED","Sales & Services of Education Dept.",50,"Revenue","9SALE","Sales & Serv-Educ Activit"]
[9605,"Other Testing Fees","ED","Sales & Services of Education Dept.",50,"Revenue","9SALE","Sales & Serv-Educ Activit"]
[9610,"Course/Use Fees","ED","Sales & Services of Education Dept.",50,"Revenue","9SALE","Sales & Serv-Educ Activit"]
[9612,"Food Sales-Instruct Prog","ED","Sales & Services of Education Dept.",50,"Revenue","9SALE","Sales & Serv-Educ Activit"]
[9616,"Child Care-Instruct Prog","ED","Sales & Services of Education Dept.",50,"Revenue","9SALE","Sales & Serv-Educ Activit"]
[9622,"Other Farm/Agricultural Sales","ED","Sales & Services of Education Dept.",50,"Revenue","9SALE","Sales & Serv-Educ Activit"]
[9623,"Meat Sales","ED","Sales & Services of Education Dept.",50,"Revenue","9SALE","Sales & Serv-Educ Activit"]
[9624,"Livestock Sales","ED","Sales & Services of Education Dept.",50,"Revenue","9SALE","Sales & Serv-Educ Activit"]
[9628,"Museum Sales","ED","Sales & Services of Education Dept.",50,"Revenue","9SALE","Sales & Serv-Educ Activit"]
[9629,"Performing Arts Sales","ED","Sales & Services of Education Dept.",50,"Revenue","9SALE","Sales & Serv-Educ Activit"]
[9630,"Publication Sales","ED","Sales & Services of Education Dept.",50,"Revenue","9SALE","Sales & Serv-Educ Activit"]
[9635,"Material Fees","ED","Sales & Services of Education Dept.",50,"Revenue","9SALE","Sales & Serv-Educ Activit"]
[9640,"Nondept Sales & Services","ED","Sales & Services of Education Dept.",50,"Revenue","9SALE","Sales & Serv-Educ Activit"]
[9702,"Aux Housing/Meal Allowance - Contra","AX","Auxiliary Enterprises",50,"Revenue","9AUXRV","Sales/Serv Of Aux Service"]
[9703,"Forfeiture Of Hsg Deposit","AX","Auxiliary Enterprises",50,"Revenue","9AUXRV","Sales/Serv Of Aux Service"]
[9704,"Housing Damage/Vandalism Chg","AX","Auxiliary Enterprises",50,"Revenue","9AUXRV","Sales/Serv Of Aux Service"]
[9705,"Housing Application Fees","AX","Auxiliary Enterprises",50,"Revenue","9AUXRV","Sales/Serv Of Aux Service"]
[9706,"Housing Laundry Revenue","AX","Auxiliary Enterprises",50,"Revenue","9AUXRV","Sales/Serv Of Aux Service"]
[9707,"Housing Pet Fees","AX","Auxiliary Enterprises",50,"Revenue","9AUXRV","Sales/Serv Of Aux Service"]
[9708,"Housing Utility Fees","AX","Auxiliary Enterprises",50,"Revenue","9AUXRV","Sales/Serv Of Aux Service"]
[9709,"Housing Key Replacement","AX","Auxiliary Enterprises",50,"Revenue","9AUXRV","Sales/Serv Of Aux Service"]
[9710,"Housing-Sundry Sales","AX","Auxiliary Enterprises",50,"Revenue","9AUXRV","Sales/Serv Of Aux Service"]
[9715,"Housing Apt Fees Academic Yr","AX","Auxiliary Enterprises",50,"Revenue","9AUXRV","Sales/Serv Of Aux Service"]
[9716,"Housing Res Hall Fees Acad Yr","AX","Auxiliary Enterprises",50,"Revenue","9AUXRV","Sales/Serv Of Aux Service"]
[9717,"Housing Property Rental Fees","AX","Auxiliary Enterprises",50,"Revenue","9AUXRV","Sales/Serv Of Aux Service"]
[9720,"Housing Summer Fees Students","AX","Auxiliary Enterprises",50,"Revenue","9AUXRV","Sales/Serv Of Aux Service"]
[9721,"Housing Conference Fees-Indiv","AX","Auxiliary Enterprises",50,"Revenue","9AUXRV","Sales/Serv Of Aux Service"]
[9722,"Housing Fees Charged To Depts","AX","Auxiliary Enterprises",50,"Revenue","9AUXRV","Sales/Serv Of Aux Service"]
[9723,"Housing, Summer Fees - Bed Tax","AX","Auxiliary Enterprises",50,"Revenue","9AUXRV","Sales/Serv Of Aux Service"]
[9725,"Student Union User Fee-Students","AX","Auxiliary Enterprises",50,"Revenue","9AUXRV","Sales/Serv Of Aux Service"]
[9726,"Student Union User Fees-Depts","AX","Auxiliary Enterprises",50,"Revenue","9AUXRV","Sales/Serv Of Aux Service"]
[9727,"Student Unin User Fees-Other","AX","Auxiliary Enterprises",50,"Revenue","9AUXRV","Sales/Serv Of Aux Service"]
[9730,"Auxiliary-Misc Revenue","AX","Auxiliary Enterprises",50,"Revenue","9AUXRV","Sales/Serv Of Aux Service"]
[9731,"Aux Vending Machine Rev","AX","Auxiliary Enterprises",50,"Revenue","9AUXRV","Sales/Serv Of Aux Service"]
[9732,"Rent/Lease Aux.Fac for Non Aux.Acti","AX","Auxiliary Enterprises",50,"Revenue","9AUXRV","Sales/Serv Of Aux Service"]
[9733,"Special Eents Receipts","AX","Auxiliary Enterprises",50,"Revenue","9AUXRV","Sales/Serv Of Aux Service"]
[9739,"Student Transportation Fee","AX","Auxiliary Enterprises",50,"Revenue","9AUXRV","Sales/Serv Of Aux Service"]
[9740,"Aux Food Serv-Meal/Board Rev","AX","Auxiliary Enterprises",50,"Revenue","9AUXRV","Sales/Serv Of Aux Service"]
[9741,"Food Svc - Meal/Board Rev Offset","AX","Auxiliary Enterprises",50,"Revenue","9AUXRV","Sales/Serv Of Aux Service"]
[9742,"Food Svc Walk in/Non Plan Sales","AX","Auxiliary Enterprises",50,"Revenue","9AUXRV","Sales/Serv Of Aux Service"]
[9743,"Food Svc Catering-Non Univ.Dept","AX","Auxiliary Enterprises",50,"Revenue","9AUXRV","Sales/Serv Of Aux Service"]
[9744,"Food Svc Catering-University Depts","AX","Auxiliary Enterprises",50,"Revenue","9AUXRV","Sales/Serv Of Aux Service"]
[9745,"Aux Parking Fees","AX","Auxiliary Enterprises",50,"Revenue","9AUXRV","Sales/Serv Of Aux Service"]
[9746,"Auxiliary Parking Garage","AX","Auxiliary Enterprises",50,"Revenue","9AUXRV","Sales/Serv Of Aux Service"]
[9747,"Aux Parking Citation Fees","AX","Auxiliary Enterprises",50,"Revenue","9AUXRV","Sales/Serv Of Aux Service"]
[9748,"Aux Daily Parking Fees","AX","Auxiliary Enterprises",50,"Revenue","9AUXRV","Sales/Serv Of Aux Service"]
[9749,"Aux Parking Meter Rev","AX","Auxiliary Enterprises",50,"Revenue","9AUXRV","Sales/Serv Of Aux Service"]
[9751,"Gift Sales To Depts","AX","Auxiliary Enterprises",50,"Revenue","9AUXRV","Sales/Serv Of Aux Service"]
[9752,"News/Periodical Sale-Dept","AX","Auxiliary Enterprises",50,"Revenue","9AUXRV","Sales/Serv Of Aux Service"]
[9753,"Clothing Sales To Depts","AX","Auxiliary Enterprises",50,"Revenue","9AUXRV","Sales/Serv Of Aux Service"]
[9754,"Paperback Sales To Depts","AX","Auxiliary Enterprises",50,"Revenue","9AUXRV","Sales/Serv Of Aux Service"]
[9755,"Textbook Sales To Depts","AX","Auxiliary Enterprises",50,"Revenue","9AUXRV","Sales/Serv Of Aux Service"]
[9756,"Tradebok Sales To Depts","AX","Auxiliary Enterprises",50,"Revenue","9AUXRV","Sales/Serv Of Aux Service"]
[9757,"Supply Sales To Depts","AX","Auxiliary Enterprises",50,"Revenue","9AUXRV","Sales/Serv Of Aux Service"]
[9758,"Sundry Sales To Depts","AX","Auxiliary Enterprises",50,"Revenue","9AUXRV","Sales/Serv Of Aux Service"]
[9759,"Equipment Sales To Depts","AX","Auxiliary Enterprises",50,"Revenue","9AUXRV","Sales/Serv Of Aux Service"]
[9761,"Othr Aux Rev From Depts","AX","Auxiliary Enterprises",50,"Revenue","9AUXRV","Sales/Serv Of Aux Service"]
[9762,"Aux Prking Prmt-Dept Rev","AX","Auxiliary Enterprises",50,"Revenue","9AUXRV","Sales/Serv Of Aux Service"]
[9763,"Aux Prking Dept Access","AX","Auxiliary Enterprises",50,"Revenue","9AUXRV","Sales/Serv Of Aux Service"]
[9764,"Electronics Sales","AX","Auxiliary Enterprises",50,"Revenue","9AUXRV","Sales/Serv Of Aux Service"]
[9765,"Insignia Sales","AX","Auxiliary Enterprises",50,"Revenue","9AUXRV","Sales/Serv Of Aux Service"]
[9766,"Software/Peripheral Sales","AX","Auxiliary Enterprises",50,"Revenue","9AUXRV","Sales/Serv Of Aux Service"]
[9770,"Student Health Center Fees","AX","Auxiliary Enterprises",50,"Revenue","9AUXRV","Sales/Serv Of Aux Service"]
[9771,"X-Ray/Lab Fees","AX","Auxiliary Enterprises",50,"Revenue","9AUXRV","Sales/Serv Of Aux Service"]
[9772,"Prescription Drugs","AX","Auxiliary Enterprises",50,"Revenue","9AUXRV","Sales/Serv Of Aux Service"]
[9773,"Other Health Center Fees","AX","Auxiliary Enterprises",50,"Revenue","9AUXRV","Sales/Serv Of Aux Service"]
[9783,"New Textbook Rentals","AX","Auxiliary Enterprises",50,"Revenue","9AUXRV","Sales/Serv Of Aux Service"]
[9784,"Used Textbook Rental","AX","Auxiliary Enterprises",50,"Revenue","9AUXRV","Sales/Serv Of Aux Service"]
[9785,"Digital Texbook Sales","AX","Auxiliary Enterprises",50,"Revenue","9AUXRV","Sales/Serv Of Aux Service"]
[9786,"Graduation Sales","AX","Auxiliary Enterprises",50,"Revenue","9AUXRV","Sales/Serv Of Aux Service"]
[9787,"Electronics Sales","AX","Auxiliary Enterprises",50,"Revenue","9AUXRV","Sales/Serv Of Aux Service"]
[9788,"Insignia Sales","AX","Auxiliary Enterprises",50,"Revenue","9AUXRV","Sales/Serv Of Aux Service"]
[9789,"Software/Peripherals Sales","AX","Auxiliary Enterprises",50,"Revenue","9AUXRV","Sales/Serv Of Aux Service"]
[9790,"Auxiliary Carryforward","AX","Auxiliary Enterprises",50,"Revenue","9AUXRV","Sales/Serv Of Aux Service"]
[9791,"Gift Sales","AX","Auxiliary Enterprises",50,"Revenue","9AUXRV","Sales/Serv Of Aux Service"]
[9792,"Newspaper/Periodical Sale","AX","Auxiliary Enterprises",50,"Revenue","9AUXRV","Sales/Serv Of Aux Service"]
[9793,"Clothing Sales","AX","Auxiliary Enterprises",50,"Revenue","9AUXRV","Sales/Serv Of Aux Service"]
[9794,"Paperback Sales","AX","Auxiliary Enterprises",50,"Revenue","9AUXRV","Sales/Serv Of Aux Service"]
[9795,"Textbook Sales","AX","Auxiliary Enterprises",50,"Revenue","9AUXRV","Sales/Serv Of Aux Service"]
[9796,"Trade Book Sales","AX","Auxiliary Enterprises",50,"Revenue","9AUXRV","Sales/Serv Of Aux Service"]
[9797,"Supply Sales","AX","Auxiliary Enterprises",50,"Revenue","9AUXRV","Sales/Serv Of Aux Service"]
[9798,"Sundry Sales","AX","Auxiliary Enterprises",50,"Revenue","9AUXRV","Sales/Serv Of Aux Service"]
[9799,"Equipment Sales","AX","Auxiliary Enterprises",50,"Revenue","9AUXRV","Sales/Serv Of Aux Service"]
[9803,"Student ID Card Revenue","RV","Other Revenue Sources",50,"Revenue","9OTHRV","Other Sources Of Revenue"]
[9804,"Sundry Sales Revenue","RV","Other Revenue Sources",50,"Revenue","9OTHRV","Other Sources Of Revenue"]
[9805,"Misc Rev Not Inter/Intra","RV","Other Revenue Sources",50,"Revenue","9OTHRV","Other Sources Of Revenue"]
[9806,"Ski Pass Revenue","RV","Other Revenue Sources",50,"Revenue","9OTHRV","Other Sources Of Revenue"]
[9807,"Bus Pass/Token Revenue","RV","Other Revenue Sources",50,"Revenue","9OTHRV","Other Sources Of Revenue"]
[9808,"Special Event Revenue","RV","Other Revenue Sources",50,"Revenue","9OTHRV","Other Sources Of Revenue"]
[9809,"Booster Club Membership","RV","Other Revenue Sources",50,"Revenue","9OTHRV","Other Sources Of Revenue"]
[9810,"Indirect Cost Recovery","IR","Indirect Cost Recovery",50,"Revenue","9IDNRV","Indirect Cost Recovery"]
[9811,"Indirect Cost Support","IR","Indirect Cost Recovery",50,"Revenue","9IDNRV","Indirect Cost Recovery"]
[9820,"Vending Machines Revenue","RV","Other Revenue Sources",50,"Revenue","9OTHRV","Other Sources Of Revenue"]
[9821,"Utility Fees","RV","Other Revenue Sources",50,"Revenue","9OTHRV","Other Sources Of Revenue"]
[9822,"Parking Fees","RV","Other Revenue Sources",50,"Revenue","9OTHRV","Other Sources Of Revenue"]
[9823,"Game Room Revenue","RV","Other Revenue Sources",50,"Revenue","9OTHRV","Other Sources Of Revenue"]
[9824,"Bidder Application Fees","RV","Other Revenue Sources",50,"Revenue","9OTHRV","Other Sources Of Revenue"]
[9825,"Bond Proceeds","BD","Bond Proceeds",50,"Revenue","9BOND","Bond Proceeds"]
[9826,"Bond Premium/Discount","BD","Bond Proceeds",50,"Revenue","9BOND","Bond Proceeds"]
[9827,"Admin Services Revenue","RV","Other Revenue Sources",50,"Revenue","9OTHRV","Other Sources Of Revenue"]
[9830,"Investment Revenue","II","Interest Income",50,"Revenue","9INTST","Interest Income"]
[9831,"Investment Fees","II","Interest Income",50,"Revenue","9INTST","Interest Income"]
[9832,"Interest Income Carryfowd","II","Interest Income",50,"Revenue","9INTST","Interest Income"]
[9835,"Gains & Losses On Invest","II","Interest Income",50,"Revenue","9INTST","Interest Income"]
[9836,"Unrealized Gains & Losses on Invest","II","Interest Income",50,"Revenue","9INTST","Interest Income"]
[9839,"Savings Plan Revenue","RV","Other Revenue Sources",50,"Revenue","9EST","Education Savings Trust Earnings"]
[9840,"Computer Serv Off Campus","RV","Other Revenue Sources",50,"Revenue","9OTHRV","Other Sources Of Revenue"]
[9844,"Royalty Revenue","RV","Other Revenue Sources",50,"Revenue","9OTHRV","Other Sources Of Revenue"]
[9845,"Warehouse Offcampus Rev","RV","Other Revenue Sources",50,"Revenue","9OTHRV","Other Sources Of Revenue"]
[9846,"Coinop Copiers Revenue","RV","Other Revenue Sources",50,"Revenue","9OTHRV","Other Sources Of Revenue"]
[9847,"Repro & Graphics Serv Off","RV","Other Revenue Sources",50,"Revenue","9OTHRV","Other Sources Of Revenue"]
[9850,"Real Estate Rentals","RV","Other Revenue Sources",50,"Revenue","9OTHRV","Other Sources Of Revenue"]
[9851,"Equipment Rentals","RV","Other Revenue Sources",50,"Revenue","9OTHRV","Other Sources Of Revenue"]
[9852,"Veh,Airplane,Boat Rentals","RV","Other Revenue Sources",50,"Revenue","9OTHRV","Other Sources Of Revenue"]
[9853,"Misc Housing Rev","RV","Other Revenue Sources",50,"Revenue","9OTHRV","Other Sources Of Revenue"]
[9854,"Space Rent-Non UA Users","RV","Other Revenue Sources",50,"Revenue","9OTHRV","Other Sources Of Revenue"]
[9855,"Ship Use Revenue","RV","Other Revenue Sources",50,"Revenue","9OTHRV","Other Sources Of Revenue"]
[9856,"R/SV Cntr Rev fr Non-Univ","RV","Other Revenue Sources",50,"Revenue","9OTHRV","Other Sources Of Revenue"]
[9857,"R/SV Cntr Refenue Fed E-Rate Rebate","RV","Other Revenue Sources",50,"Revenue","9OTHRV","Other Sources Of Revenue"]
[9858,"Museum Admissions","RV","Other Revenue Sources",50,"Revenue","9OTHRV","Other Sources Of Revenue"]
[9860,"Misc Sales & Rental Rev","RV","Other Revenue Sources",50,"Revenue","9OTHRV","Other Sources Of Revenue"]
[9861,"Book/Publication Sales","RV","Other Revenue Sources",50,"Revenue","9OTHRV","Other Sources Of Revenue"]
[9862,"Locker Rental Revenue","RV","Other Revenue Sources",50,"Revenue","9OTHRV","Other Sources Of Revenue"]
[9863,"Outdoor Equipment Rental","RV","Other Revenue Sources",50,"Revenue","9OTHRV","Other Sources Of Revenue"]
[9871,"Raffle/Gaming Permit Rev","RV","Other Revenue Sources",50,"Revenue","9OTHRV","Other Sources Of Revenue"]
[9872,"Net Raffle Proceeds - Unrst","RV","Other Revenue Sources",50,"Revenue","9OTHRV","Other Sources Of Revenue"]
[9879,"Museum Store Sales","RV","Other Revenue Sources",50,"Revenue","9OTHRV","Other Sources Of Revenue"]
[9880,"Athletic Ticket (Non-season) Sales","RV","Other Revenue Sources",50,"Revenue","9OTHRV","Other Sources Of Revenue"]
[9881,"Athletic Broadcast Rights","RV","Other Revenue Sources",50,"Revenue","9OTHRV","Other Sources Of Revenue"]
[9882,"Athletic Guarantees","RV","Other Revenue Sources",50,"Revenue","9OTHRV","Other Sources Of Revenue"]
[9883,"Athlete Concess Sale-Food","RV","Other Revenue Sources",50,"Revenue","9OTHRV","Other Sources Of Revenue"]
[9884,"Athlete Concess Sale-Othe","RV","Other Revenue Sources",50,"Revenue","9OTHRV","Other Sources Of Revenue"]
[9885,"Athletic Season Ticket Sales","RV","Other Revenue Sources",50,"Revenue","9OTHRV","Other Sources Of Revenue"]
[9889,"Other Athletic Activities","RV","Other Revenue Sources",50,"Revenue","9OTHRV","Other Sources Of Revenue"]
[9890,"UA Receipts Unreserved Fund Balance","RV","Other Revenue Sources",50,"Revenue","9OTHRV","Other Sources Of Revenue"]
[9891,"Statewide Revenue Transfer","RV","Other Revenue Sources",50,"Revenue","9OTHRV","Other Sources Of Revenue"]
[9892,"Additions to Plant Facilities","RV","Other Revenue Sources",50,"Revenue","9OTHRV","Other Sources Of Revenue"]
[9901,"Interdept Phys Pl Lab Rec","IA","Inter/Intra Campus Revenue",50,"Revenue","9TRNF","Interdept Revenue Transfer"]
[9902,"Interdept Phys Pl/Whs Rec","IA","Inter/Intra Campus Revenue",50,"Revenue","9TRNF","Interdept Revenue Transfer"]
[9904,"Interdept Revenue","IA","Inter/Intra Campus Revenue",50,"Revenue","9TRNF","Interdept Revenue Transfer"]
[9905,"Interdept Rch Ser Ctr Rev","IA","Inter/Intra Campus Revenue",50,"Revenue","9TRNF","Interdept Revenue Transfer"]
[9906,"Interdept Computr Ser Rev","IA","Inter/Intra Campus Revenue",50,"Revenue","9TRNF","Interdept Revenue Transfer"]
[9907,"Interdept Cent Stores Rev","IA","Inter/Intra Campus Revenue",50,"Revenue","9TRNF","Interdept Revenue Transfer"]
[9908,"Interdept Tel Svcs Rev","IA","Inter/Intra Campus Revenue",50,"Revenue","9TRNF","Interdept Revenue Transfer"]
[9909,"Interdept Adm Sup Ser Fee","IA","Inter/Intra Campus Revenue",50,"Revenue","9TRNF","Interdept Revenue Transfer"]
[9910,"Interdept Facil Use Fee","IA","Inter/Intra Campus Revenue",50,"Revenue","9TRNF","Interdept Revenue Transfer"]
[9911,"Interdept Unbilled W/O Rev","IA","Inter/Intra Campus Revenue",50,"Revenue","9TRNF","Interdept Revenue Transfer"]
[9915,"Interdept Postage Rev","IA","Inter/Intra Campus Revenue",50,"Revenue","9TRNF","Interdept Revenue Transfer"]
[9916,"Intracmps Reproduct'N Rev","IA","Inter/Intra Campus Revenue",50,"Revenue","9TRNF","Interdept Revenue Transfer"]
[9917,"Interdept Graphic Ser Rev","IA","Inter/Intra Campus Revenue",50,"Revenue","9TRNF","Interdept Revenue Transfer"]
[9920,"Interdept Ship Revenue","IA","Inter/Intra Campus Revenue",50,"Revenue","9TRNF","Interdept Revenue Transfer"]
[9921,"Interdept Y2K Financing","IA","Inter/Intra Campus Revenue",50,"Revenue","9TRNF","Interdept Revenue Transfer"]
[9934,"Bad Account","IA","Inter/Intra Campus Revenue",50,"Revenue","9TRNF","Interdept Revenue Transfer"]
[9945,"Inter-university interest income","IA","Inter/Intra Campus Revenue",50,"Revenue","9TRNF","Interdept Revenue Transfer"]
[9951,"Interdept Corporate Training","IA","Inter/Intra Campus Revenue",50,"Revenue","9TRNF","Interdept Revenue Transfer"]
[9961,"CIP Revenue Budget","IA","Inter/Intra Campus Revenue",50,"Revenue","9CIPRV","Interdept CIP Revenue"]
[9962,"Interdept CIP Salary Rev","IA","Inter/Intra Campus Revenue",50,"Revenue","9CIPRV","Interdept CIP Revenue"]
[9963,"CIP Carry Forward","IA","Inter/Intra Campus Revenue",50,"Revenue","9CIPRV","Interdept CIP Revenue"]
[9965,"Admin Recovery Plant","IA","Inter/Intra Campus Revenue",50,"Revenue","9CIPRV","Interdept CIP Revenue"]
[9981,"Capital Project Revenue","IA","Inter/Intra Campus Revenue",50,"Revenue","9TRNF","Interdept Revenue Transfer"]
[9992,"Agency Receipts from UA","IA","Inter/Intra Campus Revenue",50,"Revenue","9TRNF","Interdept Revenue Transfer"]